program: Gaussian 09
title: 000257698
version: EM64L-G09RevD.01
frameworkgroup: C1[X(C16H19NO8)]
method: RPBEPBE
basis: SDD
operation: Freq
keyword: #p
keyword: freq=noraman
keyword: PBEPBE/SDD
title: #p freq=noraman PBEPBE/SDD
converged: YES YES NO NO
title: Mulliken charges:
elementType: O O O O O O O O N C C C C C C C C C C C C C C C C H H H H H H H H H H H H H H H H H H H
charge: -0.246921 -0.267161 -0.256644 -0.308123 -0.256383 -0.238981 -0.199389 -0.200719 0.027829 -0.194243 -0.088110 -0.050674 -0.080130 -0.358659 0.366392 -0.697912 -0.704203 0.225105 -0.502275 0.226791 -0.315108 -0.312317 -0.352252 -0.345707 0.388559 0.272101 0.246319 0.316958 0.241441 0.208681 0.252242 0.267957 0.213380 0.220124 0.222163 0.237427 0.220188 0.237964 0.206666 0.233384 0.282228 0.279901 0.292025 0.290087
chargesum: 0.00000
title: Mulliken charges with hydrogens summed into heavy atoms:
elementType: O O O O O O O O N C C C C C C C C C C C C C C C C
charge: -0.246921 -0.267161 -0.256644 -0.308123 -0.256383 -0.238981 -0.199389 -0.200719 0.027829 0.077858 0.158209 0.266285 0.161311 0.102264 0.366392 0.003549 -0.024424 0.225105 0.175739 0.226791 -0.032881 -0.032416 -0.060227 -0.055620 0.388559
polarizability: 3.02244714e+02 2.10427322e+00 1.80211014e+02 4.21033913e+00 -2.61433927e+01 1.69621239e+02
1716.lowfreq: -11.6199 -4.5298 -0.0009 -0.0006 -0.0005 4.2958 20.1232 24.1516 32.4455
frequency: 19.7691 23.9314 32.3070 52.6414 53.5303 64.9199 70.1323 86.1236 90.4007 111.7959 132.2278 151.9216 167.6825 183.3972 195.4075 216.3415 233.1035 243.6504 249.5127 284.7553 295.6843 311.5911 328.2900 343.9571 372.5069 409.9918 411.1849 435.7457 443.3591 460.2200 466.8458 479.9401 487.8766 515.2223 521.6061 555.7372 623.5654 628.8362 649.8008 658.7402 679.1333 683.2690 695.3968 743.8957 762.4344 765.5898 774.1651 801.5959 823.5442 863.1519 864.3733 879.6158 888.8606 912.1744 922.8641 928.4509 965.6918 974.3195 989.9283 1004.3492 1005.2368 1011.7597 1021.7278 1042.3100 1052.8638 1060.5047 1067.3838 1087.1873 1089.9587 1109.8329 1113.8725 1119.9973 1142.1924 1152.8501 1176.5129 1199.6935 1212.5067 1215.7741 1228.1439 1239.8676 1249.1706 1254.5559 1268.6627 1283.7051 1293.5506 1314.1004 1329.9325 1345.4869 1349.5830 1363.3570 1368.2830 1380.5784 1399.5687 1405.3253 1415.1010 1431.0245 1445.3364 1451.1269 1457.4303 1464.5653 1471.3628 1474.8615 1478.0200 1483.5883 1591.5242 1609.6355 1628.0470 2956.4896 2991.0565 2996.0901 3002.2519 3007.5566 3054.6212 3058.7291 3072.9891 3101.2085 3103.0803 3107.1146 3107.9145 3111.2663 3122.0431 3124.3431 3165.2577 3176.3022 3188.1586 3194.0309
redmass: 6.7985 5.5380 4.8341 5.6224 6.9699 3.6883 5.5649 6.8451 5.6076 2.5525 1.7192 1.5793 1.5822 5.9858 1.3491 2.9945 5.6457 3.0130 3.9896 7.4060 5.5036 3.7112 4.9462 4.0380 3.3994 2.8826 2.7177 4.9693 4.2640 4.2757 4.2760 4.1763 8.9343 5.9781 5.2879 5.1208 7.0998 6.4123 6.3142 8.0074 4.7042 4.0580 6.2140 3.3842 5.0907 4.8939 5.2886 6.8374 5.1495 2.7033 1.5894 4.4500 1.6652 3.5205 1.5658 3.6243 2.9880 4.3062 1.3610 1.4256 2.9851 1.3687 5.0147 2.9869 3.9264 5.6206 4.6339 2.5897 3.2764 1.3282 1.2881 3.1618 1.9137 1.4402 1.2339 2.1273 3.2155 2.4510 1.3980 3.1879 1.5751 1.9567 1.2934 1.3570 1.2630 1.2145 1.2168 1.3924 1.2779 1.3361 7.8508 1.2674 1.2166 8.1895 4.5289 1.1510 1.0664 1.0540 1.0505 1.0579 1.0623 2.4124 1.0528 1.0548 8.7504 6.3646 11.1499 1.0357 1.0644 1.0860 1.0376 1.0364 1.0987 1.0860 1.0886 1.0991 1.1002 1.0975 1.0861 1.0995 1.0994 1.1012 1.0901 1.0890 1.0959 1.0973
irintensity: 0.0306 0.0207 0.0998 0.0047 0.1903 2.7772 0.6866 2.3754 5.4716 3.3084 1.3262 0.5677 0.0313 5.7824 2.1931 2.5982 7.0724 3.0221 4.8333 8.0759 3.7547 10.4390 0.7869 5.1979 5.9251 0.0136 2.4774 21.0062 6.3858 0.8496 7.0662 19.0649 8.1995 3.6366 4.3312 1.7015 1.0518 3.0630 0.5628 5.6045 21.1882 45.7869 11.6115 32.6410 3.3929 27.9750 22.3653 4.7430 15.5964 66.2348 34.8196 10.4667 56.8125 26.1145 10.8278 91.4195 27.0725 22.1744 0.5195 6.4340 50.7945 0.0828 131.2274 65.3409 14.4834 372.0566 120.0736 7.1190 10.3096 11.7288 0.7433 7.1697 52.1466 6.8944 3.5376 99.7134 363.2418 217.1209 10.7722 111.5365 21.6398 37.7236 9.3973 14.1265 1.2966 11.3855 15.4697 14.6986 3.4778 5.2767 84.8016 42.5932 28.1331 10.5701 62.8483 5.9036 5.7486 4.2883 9.9959 18.3430 13.0837 3.7981 9.1500 12.3693 34.6053 3.8116 136.7303 70.3996 44.4524 43.1387 23.8550 19.7842 42.7904 14.3913 28.8658 21.6299 5.9359 10.3550 9.1612 27.4791 11.0686 19.2633 1.2126 1.1541 0.5185 0.6142
temp: 298.150 k
press: 1.00000 atm
elementType: 8 8 8 8 8 8 8 8 7 6 6 6 6 6 6 6 6 6 6 6 6 6 6 6 6 1 1 1 1 1 1 1 1 1 1 1 1 1 1 1 1 1 1 1
symmnumber: 1
zpe: 885148.2 jmol-1
zpe.correction: 0.337135 hartree
zpe.thermalcorrener: 0.360979 hartree
zpe.thermalcorrenthalpy: 0.361923 hartree
zpe.thermalcorrgfe: 0.281507 hartree
zpe.sumelectzpe: -1275.645756 hartree
zpe.sumelectthermal: -1275.621913 hartree
zpe.sumelectthermalent: -1275.620968 hartree
zpe.sumelectthermalfe: -1275.701385 hartree
dipole: 5.3654 1.1142 -1.0213
dipole: 5.5742
quadrupole: -176.6222 -135.4523 -146.8978
quadrupole: 0.0715 -10.5278 1.8612
quadrupole: -23.6314 17.5385 6.0930 0.0715 -10.5278 1.8612
hfenergy: -1275.9828915 hartree
pointgroup: C01 [X(C16H19N1O8)]
dipole: -2.0002651 -0.1596894 0.8848816 debye
polarizability: 300.4631886|-1.1094622|148.7538308|-13.8538567|-5.7531096|202.859947 unknown
InChI: InChI=1S/C16H19NO8/c1-16(2)22-8-11-12(25-16)13(15(21-3)23-11)24-14(18)9-4-6-10(7-5-9)17(19)20/h4-7,11-13,15H,8H2,1-3H3
charge 0 multiplicity 1
44 atoms
O  -2.829027 0.062489 2.68718
O  -2.642298 -1.871891 -0.469301
O  -4.395212 -0.185639 -0.354191
O  -0.126504 0.123376 0.48889
O  -2.616276 2.194314 1.54071
O  -0.198084 0.847124 -1.737042
O  6.812075 0.078152 -1.888342
O  6.767259 -0.666421 0.267221
N  6.190122 -0.224992 -0.799283
C  -2.22024 -1.19578 0.74806
C  -3.366687 -0.978115 1.77744
C  -1.601896 0.225638 0.59982
C  -1.952969 0.966231 1.904698
C  -4.668995 -0.572347 1.044919
C  -3.830536 -1.262757 -1.175465
C  -3.363708 -0.607724 -2.477033
C  -4.810705 -2.42263 -1.406401
C  0.451611 0.448772 -0.742841
C  -2.931797 3.046689 2.698917
C  1.936236 0.263306 -0.716083
C  2.663023 0.585307 -1.891895
C  2.614595 -0.219851 0.433124
C  4.060098 0.428579 -1.927282
C  4.012317 -0.382343 0.410851
C  4.712039 -0.054379 -0.771132
H  -1.45015 -1.861473 1.173024
H  -3.531052 -1.861712 2.41553
H  -2.003778 0.774006 -0.264523
H  -1.074967 1.163932 2.551592
H  -5.414117 -1.39089 1.083089
H  -5.098346 0.330424 1.505671
H  -2.600646 0.162736 -2.285366
H  -2.921221 -1.374041 -3.135338
H  -4.222201 -0.143305 -2.992262
H  -5.687993 -2.068991 -1.974748
H  -4.305069 -3.214229 -1.98429
H  -5.149612 -2.869566 -0.456735
H  -3.397798 3.952308 2.283111
H  -2.009156 3.31979 3.251386
H  -3.632697 2.535684 3.383899
H  2.114019 0.954675 -2.7634
H  2.040763 -0.464885 1.329885
H  4.647352 0.667934 -2.81722
H  4.564834 -0.7533 1.277658
