program: Gaussian 09
title: 000257694
version: EM64L-G09RevD.01
frameworkgroup: C1[X(C13H19NO2)]
method: RPBEPBE
basis: SDD
operation: Freq
keyword: #p
keyword: freq=noraman
keyword: PBEPBE/SDD
title: #p freq=noraman PBEPBE/SDD
converged: YES YES NO NO
title: Mulliken charges:
elementType: O O N C C C C C C C C C C C C C H H H H H H H H H H H H H H H H H H H
charge: -0.413996 -0.238282 -0.127306 -0.110117 -0.073426 -0.510840 -0.705897 -0.715230 0.135941 -0.628807 0.462544 -0.375938 -0.457315 -0.234544 -0.219735 -0.245122 0.241043 0.222997 0.242884 0.219351 0.211536 0.245215 0.201932 0.235471 0.205409 0.218303 0.223593 0.247904 0.208280 0.254174 0.234942 0.368799 0.224218 0.224774 0.227245
chargesum: 0.00000
title: Mulliken charges with hydrogens summed into heavy atoms:
elementType: O O N C C C C C C C C C C C C C
charge: -0.045197 -0.238282 -0.127306 0.130926 0.149571 -0.048605 -0.047214 -0.056047 0.135941 0.050969 0.462544 -0.121764 -0.222373 -0.010326 0.005040 -0.017877
polarizability: 1.97973434e+02 4.50532393e+00 1.41073296e+02 2.12900865e-01 1.57328719e+01 1.18419977e+02
1716.lowfreq: -12.7828 -7.6456 -2.9555 -0.0004 0.0002 0.0005 24.6091 34.6486 43.7357
frequency: 23.5561 34.4407 43.6863 53.0608 75.9502 112.3349 128.4915 158.9473 166.1864 180.1120 206.6762 223.6443 232.7406 267.8993 306.9030 334.9252 344.2373 370.7980 399.9644 407.7471 454.1744 476.5611 497.6548 586.8594 596.0820 616.6056 644.1061 706.0856 717.8054 741.4180 794.3965 840.1941 847.8796 860.8601 870.8881 910.8748 924.5576 949.4986 960.0276 974.4181 984.0079 990.5497 999.7554 1024.4888 1026.5284 1034.5568 1079.4758 1104.7701 1118.1580 1133.7654 1154.1733 1169.6075 1179.5593 1181.5482 1202.0054 1214.1908 1229.2810 1275.2609 1293.3827 1313.1430 1316.0830 1339.0116 1348.7509 1363.6955 1377.1009 1389.3278 1396.4977 1434.1381 1442.3518 1456.8270 1461.1670 1466.9852 1467.9801 1481.8235 1483.1299 1487.1457 1488.4748 1593.8887 1614.7167 1638.0059 2892.4803 2903.0592 2973.1623 2977.1832 2989.0372 3027.7470 3031.1282 3036.6759 3063.8278 3071.5725 3076.9292 3092.9752 3095.4800 3113.9617 3122.7040 3135.8168 3146.6459 3161.3881 3481.9614
redmass: 3.4553 3.2812 4.8988 3.7655 4.6104 3.0400 5.7479 3.3246 1.7784 1.6906 1.1469 1.1773 2.3742 3.2446 2.9236 2.2789 4.5162 3.5899 2.5717 2.8646 2.6011 3.0716 3.5227 2.6030 3.1667 6.3348 1.9113 2.3154 4.5691 1.5556 3.6740 3.4561 2.6664 1.2502 3.3924 1.3725 1.1934 2.1199 1.5219 1.8387 1.3984 5.7336 1.3517 2.1747 2.2173 2.0416 1.5583 2.7005 1.3408 2.2966 1.9492 1.0634 1.8561 1.1143 2.1862 2.4305 1.5590 1.4755 1.6984 1.4068 1.4038 1.5240 1.4035 1.6216 1.2075 3.5478 1.2105 1.2639 1.7984 1.0958 1.0493 1.0652 1.0635 1.2317 1.6704 1.0531 1.0518 6.1449 6.1102 7.8286 1.0705 1.0535 1.0361 1.0389 1.0816 1.0860 1.0854 1.0774 1.0990 1.0988 1.0990 1.1013 1.0977 1.0865 1.0863 1.0915 1.0953 1.1014 1.0638
irintensity: 0.4183 0.1132 1.8121 0.0407 0.7685 0.5800 0.2354 2.0712 0.9296 1.3832 0.1670 0.4758 2.6596 0.9859 3.0650 7.3283 13.7307 3.1709 2.4260 0.2620 8.0877 8.9631 7.0315 55.8150 46.7249 0.6736 59.4648 26.2752 27.2662 56.2969 23.0141 4.1891 4.7442 0.0519 14.7502 3.0058 3.7237 42.2761 16.1134 15.4716 0.4533 0.2462 3.1883 82.9000 171.9948 40.1719 8.5101 33.5312 2.7251 7.3425 12.4626 0.4864 4.2154 1.6524 1.8909 5.5132 0.9673 1.9677 13.6516 4.6790 1.7651 11.3820 6.9705 2.0199 18.1148 3.7753 20.1410 5.4553 13.4509 5.4700 5.3145 25.0588 1.8213 11.7831 14.2806 3.5856 18.8135 2.1465 9.4162 177.9444 35.2714 94.5965 27.4774 28.2149 11.8144 9.8456 18.1386 25.6222 7.6236 59.6400 42.1092 25.4502 32.4052 6.6749 0.0342 19.3284 36.9297 26.5228 13.6450
temp: 298.150 k
press: 1.00000 atm
elementType: 8 8 7 6 6 6 6 6 6 6 6 6 6 6 6 6 1 1 1 1 1 1 1 1 1 1 1 1 1 1 1 1 1 1 1
symmnumber: 1
zpe: 772741.5 jmol-1
zpe.correction: 0.294322 hartree
zpe.thermalcorrener: 0.311575 hartree
zpe.thermalcorrenthalpy: 0.312519 hartree
zpe.thermalcorrgfe: 0.247872 hartree
zpe.sumelectzpe: -710.747213 hartree
zpe.sumelectthermal: -710.729960 hartree
zpe.sumelectthermalent: -710.729015 hartree
zpe.sumelectthermalfe: -710.793663 hartree
dipole: -0.2324 -0.1341 1.2300
dipole: 1.2590
quadrupole: -90.4967 -90.9753 -100.9009
quadrupole: 0.3349 -2.5302 -0.1003
quadrupole: 3.6276 3.1490 -6.7766 0.3349 -2.5302 -0.1003
hfenergy: -711.0415346 hartree
pointgroup: C01 [X(C13H19N1O2)]
dipole: 0.0809219 0.0830014 0.4815554 debye
polarizability: 197.8135722|5.6516162|139.2454955|1.2643043|-16.8757803|120.4076389 unknown
InChI: InChI=1S/C13H19NO2/c1-10(2)12(13(15)16)14(3)9-11-7-5-4-6-8-11/h4-8,10,12,15H,9H2,1-3H3
charge 0 multiplicity 1
35 atoms
O  3.286273 1.974149 0.805422
O  2.566622 1.519409 -1.354789
N  0.563405 0.168386 0.700187
C  2.015643 -0.084816 0.47987
C  2.32956 -1.353337 -0.363561
C  -0.243617 0.451684 -0.512482
C  1.619134 -2.593731 0.217924
C  3.860963 -1.573648 -0.425838
C  2.657362 1.16261 -0.155947
C  0.278091 1.090329 1.823552
C  -1.734596 0.182014 -0.31298
C  -2.189553 -0.884376 0.502998
C  -2.691191 0.975986 -0.992858
C  -3.56991 -1.154584 0.630479
C  -4.073368 0.70419 -0.873032
C  -4.518271 -0.363981 -0.060585
H  2.465821 -0.215373 1.481098
H  1.976107 -1.184012 -1.400027
H  0.132465 -0.193781 -1.32752
H  -0.109125 1.500146 -0.870561
H  1.832325 -3.48427 -0.401827
H  0.526836 -2.449653 0.260326
H  1.972097 -2.802731 1.246356
H  4.383734 -0.717043 -0.888971
H  4.280157 -1.72956 0.587016
H  4.093847 -2.470446 -1.028069
H  0.832535 0.762707 2.719873
H  -0.801188 1.058467 2.049311
H  0.557036 2.149604 1.614506
H  -1.449694 -1.482891 1.046229
H  -2.352402 1.811311 -1.618978
H  3.619475 2.804861 0.365062
H  -3.907044 -1.981041 1.266982
H  -4.800247 1.327303 -1.406662
H  -5.58938 -0.574183 0.037094
