program: Gaussian 09
title: 000257692
version: EM64L-G09RevD.01
frameworkgroup: C1[X(C24H24O4)]
method: RPBEPBE
basis: SDD
operation: Freq
keyword: #pfreq=noraman
keyword: PBEPBE/SDD
title: #p freq=noraman PBEPBE/SDD
converged: NO YES NO NO
title: Mulliken charges:
elementType: O O O O C C C C C C C C C C C C C C C C C C C C C C C C H H H H H H H H H H H H H H H H H H H H H H H H
charge: -0.257988 -0.407790 -0.250851 -0.235064 -0.340638 -0.347670 -0.242116 -0.258603 0.318095 -0.487616 -0.473753 0.020120 0.198533 0.116637 0.279369 0.306275 -0.412055 -0.426882 -0.399040 -0.386793 -0.258738 -0.244585 -0.245721 -0.229649 -0.232008 -0.663327 -0.251397 -0.248526 0.300392 0.310263 0.286364 0.341437 0.236519 0.230033 0.225099 0.235158 0.377415 0.267433 0.243934 0.248598 0.251432 0.223715 0.227582 0.223963 0.225954 0.225498 0.226041 0.230474 0.251020 0.216700 0.227958 0.228799
chargesum: 0.00000
title: Mulliken charges with hydrogens summed into heavy atoms:
elementType: O O O O C C C C C C C C C C C C C C C C C C C C C C C C
charge: -0.257988 -0.030375 -0.250851 -0.235064 -0.040246 -0.037408 0.044248 0.082834 0.318095 -0.021065 -0.013496 0.020120 0.198533 0.116637 0.279369 0.306275 -0.144621 -0.182949 -0.150442 -0.135361 0.192558 -0.020622 -0.019767 -0.004151 -0.005967 0.034867 -0.023439 -0.019727
polarizability: 3.07030886e+02 -8.98565080e+00 3.02395255e+02 -1.68348594e+01 -4.51730468e+00 2.01515830e+02
1716.lowfreq: -13.0746 -10.8734 -9.4267 -0.0007 -0.0005 0.0005 4.0347 21.3228 31.6806
frequency: -6.8993 21.1725 31.6685 34.9692 37.0205 46.1619 61.9575 63.3111 68.2125 76.2442 88.7474 114.1678 118.9407 136.0268 172.3669 206.2705 217.8625 229.1541 235.1922 240.7490 277.9521 283.3815 295.6629 331.1809 374.9572 405.0200 406.5136 409.9188 429.5263 446.5414 453.5166 507.8458 553.2755 583.1753 594.4376 608.9119 615.2567 618.5525 622.8893 643.4478 657.2187 682.1948 698.0403 706.6943 708.3806 720.2273 746.7558 758.1953 780.0541 783.2412 810.7943 813.8576 823.3120 854.4887 856.3525 859.6969 886.1272 888.2024 908.8130 911.3644 924.2644 934.6562 935.8301 957.2265 978.0808 981.1147 987.5406 989.7689 989.9466 995.6962 996.8694 1008.3216 1024.8106 1026.3630 1029.8044 1033.4438 1042.1162 1079.4616 1081.1627 1083.5342 1096.4155 1126.6600 1134.8703 1142.4028 1152.1352 1156.0117 1170.5254 1171.2221 1171.7064 1182.9414 1189.0516 1190.3290 1205.2998 1207.6788 1232.7139 1247.3864 1269.0801 1276.6757 1284.7949 1289.6491 1296.3348 1299.8133 1317.5734 1321.0792 1323.4329 1352.2699 1369.8714 1374.3771 1375.8931 1390.8572 1431.9374 1432.7013 1453.8550 1462.6595 1466.3618 1477.0482 1480.7738 1483.2814 1484.3737 1580.0168 1581.9442 1607.0219 1609.2827 1622.0518 1648.1742 1675.4872 2992.9853 3005.2898 3018.3939 3024.8339 3029.8515 3050.4160 3060.4500 3082.9564 3088.3567 3092.1196 3109.8030 3116.0549 3118.1688 3120.5113 3121.3885 3127.7806 3128.0578 3140.5688 3141.7453 3148.6516 3151.9716 3163.4067 3163.7084 3507.9448
redmass: 3.6331 5.2162 5.0440 6.1791 4.2939 4.3785 4.7463 4.4324 4.7348 6.3818 4.1161 4.2504 5.4027 4.4514 4.7613 1.3953 2.2698 4.2026 4.4940 3.6890 3.6065 3.8891 4.6426 4.7421 3.7521 3.5736 3.1218 3.1917 3.5571 3.6326 4.0498 3.3781 3.4975 3.5949 4.6807 2.6185 6.2904 2.9253 6.0379 4.5744 4.3957 5.3439 3.8801 1.8212 1.8254 2.7587 3.5860 2.1376 2.2833 2.4864 3.0637 1.5062 2.0473 1.6972 1.7196 1.2911 3.4383 3.8095 3.2449 2.8013 1.7902 1.6237 2.3595 3.5445 1.4234 1.4806 3.4663 2.6704 4.0879 1.3493 1.4697 2.7553 2.4737 2.2659 2.2017 3.1528 2.2814 1.7388 1.6282 1.8095 2.1797 2.1602 2.3515 2.0452 1.4204 1.6668 1.1916 1.0556 1.2355 1.6015 1.1266 1.1207 1.4883 1.4362 1.3840 1.4535 1.4445 1.1200 2.0458 1.5063 1.7238 1.5377 1.3834 1.5682 1.5313 1.3253 6.4952 7.3535 1.8765 1.2318 2.2758 2.2730 1.0982 1.0426 1.0803 1.8097 1.2501 2.3141 1.0534 5.8860 5.9757 6.0348 6.0552 9.0020 8.3403 10.8260 1.0362 1.0586 1.0618 1.0597 1.0836 1.0846 1.1045 1.1051 1.0974 1.1033 1.0888 1.0914 1.1054 1.0845 1.0846 1.0879 1.0873 1.0922 1.0932 1.0963 1.0952 1.1011 1.1015 1.0639
irintensity: 0.8510 0.0264 0.2619 0.7353 0.2369 0.2870 0.1201 0.2464 0.5260 1.9176 1.2591 0.6823 0.9034 1.5843 0.6016 2.9126 0.2097 0.1583 0.6366 0.8854 2.2748 2.8905 0.7148 16.7736 1.7951 3.6698 2.5116 4.3716 15.4554 7.4629 4.0815 6.3167 19.7064 36.2407 14.7937 38.9761 0.3775 48.5643 3.5652 6.0274 20.4389 24.3372 9.0015 48.8080 51.1541 14.5113 11.4628 31.2374 42.5715 8.4067 2.7269 4.1491 2.7177 8.3248 3.7500 0.7681 18.8135 3.2320 10.5619 4.2454 3.6147 2.3180 4.7396 6.9702 0.3709 0.6221 2.3529 1.2285 1.0852 0.3211 0.5784 51.3880 20.1027 33.1415 28.4235 55.1575 75.3594 81.2031 19.4597 61.2461 29.9353 119.6025 196.3579 7.2813 11.8477 13.2501 7.1343 0.2654 8.3496 9.5293 2.5690 0.1218 27.4723 6.3708 2.8239 2.1063 14.2138 3.1489 0.5307 8.2316 8.1281 47.1463 10.2707 2.7778 39.7133 10.7722 1.8954 0.5165 50.5658 20.8836 9.2756 6.7581 9.7165 14.5573 2.9079 18.8792 8.7665 21.2953 10.0944 3.6835 0.0553 6.4145 4.0992 121.6695 191.0263 4.8352 22.8313 28.3106 56.1195 25.7351 2.9930 4.2873 1.2694 51.5202 30.1808 0.1562 20.8174 4.1618 33.1445 2.5096 2.1079 5.3606 0.7313 20.2994 25.8081 35.8543 19.3506 27.2912 22.7575 27.8842
temp: 298.150 k
press: 1.00000 atm
elementType: 8 8 8 8 6 6 6 6 6 6 6 6 6 6 6 6 6 6 6 6 6 6 6 6 6 6 6 6 1 1 1 1 1 1 1 1 1 1 1 1 1 1 1 1 1 1 1 1 1 1 1 1
symmnumber: 1
zpe: 1101267.9 jmol-1
zpe.correction: 0.419451 hartree
zpe.thermalcorrener: 0.444023 hartree
zpe.thermalcorrenthalpy: 0.444967 hartree
zpe.thermalcorrgfe: 0.362616 hartree
zpe.sumelectzpe: -1227.840452 hartree
zpe.sumelectthermal: -1227.815880 hartree
zpe.sumelectthermalent: -1227.814936 hartree
zpe.sumelectthermalfe: -1227.897287 hartree
dipole: 0.5110 0.7648 0.6529
dipole: 1.1280
quadrupole: -155.5354 -142.4474 -165.7772
quadrupole: -9.9626 4.7954 -0.9710
quadrupole: -0.9487 12.1392 -11.1906 -9.9626 4.7954 -0.9710
hfenergy: -1228.2599027 hartree
pointgroup: C01 [X(C24H24O4)]
dipole: -0.162695 -0.3428179 0.2300919 debye
polarizability: 309.4932006|-9.4053749|298.5673412|13.2630008|15.3378051|202.8814287 unknown
InChI: InChI=1S/C24H24O4/c1-2-28-24(27)22-18-14-13-17(21(22)23(25)26)20(18)19(15-9-5-3-6-10-15)16-11-7-4-8-12-16/h3-12,17-18,21-22,25H,2,13-14H2,1H3
charge 0 multiplicity 1
52 atoms
O  3.646929 -1.140318 -0.039456
O  1.568547 4.18565 -0.670784
O  2.276587 -0.338936 -1.748549
O  3.143298 3.39179 0.833443
C  1.049029 -0.065891 1.426266
C  0.014533 1.861651 0.735088
C  2.15048 0.633881 0.530004
C  1.390606 1.872296 -0.046802
C  -0.248914 0.353854 0.731719
C  0.945936 0.780147 2.738235
C  0.285694 2.126791 2.251131
C  -1.31928 -0.376818 0.297886
C  2.670296 -0.288281 -0.557177
C  2.14703 3.171889 0.105642
C  -1.2875 -1.87882 0.290177
C  -2.577886 0.269998 -0.198354
C  -0.225104 -2.589993 -0.330889
C  -3.177338 1.365502 0.482847
C  -2.346144 -2.622801 0.879899
C  -3.220945 -0.227914 -1.365737
C  4.239688 -2.139627 -0.983756
C  -0.208098 -4.002511 -0.336937
C  -4.363372 1.959899 -0.000852
C  -2.325621 -4.034013 0.881262
C  -4.402156 0.369104 -1.853984
C  5.408434 -1.524371 -1.757751
C  -1.253472 -4.731316 0.27533
C  -4.978659 1.468671 -1.175426
H  1.218706 -1.137763 1.593184
H  -0.734122 2.514123 0.268097
H  3.004275 0.938633 1.159252
H  1.173429 1.716754 -1.119465
H  0.301174 0.262167 3.47002
H  1.935024 0.936328 3.203369
H  -0.663362 2.322452 2.78106
H  0.943163 2.997935 2.415905
H  2.075151 5.031815 -0.530914
H  0.560699 -2.028831 -0.847606
H  -2.727694 1.728248 1.414122
H  -3.183437 -2.087182 1.34178
H  -2.781288 -1.08125 -1.893988
H  4.564549 -2.957912 -0.321392
H  3.446723 -2.491072 -1.667692
H  0.61355 -4.533535 -0.831504
H  -4.812387 2.798248 0.543925
H  -3.145376 -4.589895 1.350498
H  -4.873789 -0.022503 -2.762374
H  6.168902 -1.12082 -1.067382
H  5.057308 -0.713432 -2.417413
H  5.887218 -2.29785 -2.386776
H  -1.240677 -5.827086 0.269825
H  -5.899137 1.929414 -1.551106
