program: Gaussian 09
title: 000257690
version: EM64L-G09RevD.01
frameworkgroup: C1[X(C15H18O3)]
method: RPBEPBE
basis: SDD
operation: Freq
keyword: #pfreq=noraman
keyword: PBEPBE/SDD
title: #p freq=noraman PBEPBE/SDD
converged: YES YES NO NO
title: Mulliken charges:
elementType: O O O C C C C C C C C C C C C C C C H H H H H H H H H H H H H H H H H H
charge: -0.198995 -0.164266 -0.164378 -0.348095 -0.347816 -0.258116 -0.258999 0.275001 -0.466011 -0.465438 0.255167 0.158862 0.159323 -0.558387 -0.558364 -0.400966 -0.400946 -0.390163 0.285326 0.285326 0.279468 0.279728 0.212303 0.243352 0.243153 0.212233 0.202711 0.214519 0.214507 0.202672 0.205180 0.223898 0.223858 0.205253 0.185347 0.213751
chargesum: 0.00000
title: Mulliken charges with hydrogens summed into heavy atoms:
elementType: O O O C C C C C C C C C C C C C C C
charge: -0.198995 -0.164266 -0.164378 -0.062769 -0.062490 0.021352 0.020730 0.275001 -0.010356 -0.010053 0.255167 0.158862 0.159323 -0.141156 -0.141185 0.028112 0.028165 0.008935
polarizability: 1.75383712e+02 -1.01045050e+01 1.40162730e+02 -1.36360561e-01 -1.85600701e-01 1.54914539e+02
1716.lowfreq: -7.7396 -1.8509 -0.0004 0.0003 0.0006 9.6084 36.0298 37.9619 69.2362
frequency: 35.9029 37.9155 69.1543 96.0907 137.7026 138.3643 178.7234 194.6975 225.0272 243.7023 272.8261 306.2806 354.2054 410.8652 419.0541 446.0973 453.9057 478.2052 510.3678 555.2087 573.5278 617.9407 619.9279 633.4107 704.3417 733.1861 777.6954 788.0950 792.9418 804.6194 819.4915 820.2844 848.0675 853.5841 880.7230 891.4473 895.8154 903.1175 921.5273 924.0451 949.9725 990.8048 998.5678 1021.5088 1031.4773 1035.5179 1063.9778 1082.8902 1088.7834 1089.0417 1113.8027 1115.1132 1132.4526 1138.7263 1159.1354 1160.6418 1178.0795 1201.3740 1216.3960 1230.0546 1237.9763 1245.0148 1250.6273 1252.6939 1267.0703 1274.6020 1287.4817 1295.7268 1307.9022 1308.6691 1319.1894 1338.3339 1344.0206 1351.1033 1458.4289 1463.5223 1464.2617 1466.6542 1471.0211 1476.0116 1480.9797 1692.9824 1731.2206 1762.2016 2955.2914 2960.3039 2965.1581 2981.4464 2981.6148 3003.0041 3017.1028 3032.7796 3039.4710 3044.3664 3047.0703 3051.2100 3055.7086 3058.0276 3061.2633 3084.1625 3096.4885 3102.3822
redmass: 7.9994 5.2929 3.4333 3.8396 15.0012 2.9704 3.7783 4.5884 2.1204 2.8944 2.0679 2.8799 3.1410 4.5782 2.8493 3.9744 1.8331 4.8999 3.0018 4.4652 11.8748 7.3746 6.0789 3.2816 3.1016 6.6754 2.5847 2.0374 2.8174 3.8385 2.3335 9.1172 2.3620 1.6191 2.4393 2.4601 2.4247 2.6797 3.2152 1.4456 2.1566 2.2892 1.9975 2.0209 2.3671 2.0559 2.5621 1.3187 1.5093 1.5673 3.0209 2.4212 1.6808 2.4735 1.5924 1.3915 1.4253 1.2088 1.6042 1.2679 1.3954 1.6282 1.3613 1.4635 1.3643 1.4929 1.5105 1.5427 1.4063 1.4791 1.4530 1.4166 1.4966 1.4436 1.0940 1.0934 1.0897 1.0796 1.0842 1.0937 1.0914 12.9696 9.5783 12.7639 1.0666 1.0663 1.0640 1.0611 1.0610 1.0592 1.0626 1.0957 1.1009 1.0850 1.0997 1.0960 1.0980 1.0873 1.1044 1.1044 1.0888 1.0925
irintensity: 0.9725 2.5340 0.0714 1.4489 2.2011 0.0066 0.8962 1.9492 1.1437 0.7691 0.5984 3.5011 2.2036 4.0277 0.1159 0.0026 3.4034 0.6780 1.3352 25.5935 2.8144 1.3611 4.2776 5.6812 1.8213 10.9346 27.1431 13.8447 2.2622 0.6411 9.6085 221.4186 6.5038 11.3226 7.6338 29.1168 3.5940 2.6550 0.6688 0.1088 11.5395 10.1592 6.2638 8.5055 0.0900 3.8260 82.9356 0.0083 0.4635 16.0153 0.9189 37.1560 0.3214 117.2518 13.4336 1.9161 0.7236 0.0051 1.3886 6.4839 0.4660 0.1627 3.0891 0.7491 0.9376 1.3281 0.2400 0.4797 3.1034 1.0419 2.7933 0.2020 1.0253 1.1479 9.3893 7.8238 12.3396 3.4009 20.7681 1.5053 9.8545 425.9640 9.2363 98.2463 12.1047 50.6910 41.4362 26.1686 27.2560 30.9021 73.6289 66.8567 53.8053 5.5377 36.5619 16.5207 74.7440 5.1494 0.1739 54.1914 27.2717 2.5427
temp: 298.150 k
press: 1.00000 atm
elementType: 8 8 8 6 6 6 6 6 6 6 6 6 6 6 6 6 6 6 1 1 1 1 1 1 1 1 1 1 1 1 1 1 1 1 1 1
symmnumber: 1
zpe: 786251.3 jmol-1
zpe.correction: 0.299467 hartree
zpe.thermalcorrener: 0.314539 hartree
zpe.thermalcorrenthalpy: 0.315483 hartree
zpe.thermalcorrgfe: 0.256797 hartree
zpe.sumelectzpe: -806.724755 hartree
zpe.sumelectthermal: -806.709684 hartree
zpe.sumelectthermalent: -806.708740 hartree
zpe.sumelectthermalfe: -806.767425 hartree
dipole: 1.1699 -5.1879 -0.0191
dipole: 5.3182
quadrupole: -92.5166 -117.0347 -116.1466
quadrupole: -2.2915 0.0980 0.0179
quadrupole: 16.0493 -8.4687 -7.5806 -2.2915 0.0980 0.0179
hfenergy: -807.0242223 hartree
pointgroup: C01 [X(C15H18O3)]
dipole: -0.2004041 2.0826349 -0.0173903 debye
polarizability: 172.3116871|-14.1717652|143.2367173|0.2222249|0.225982|154.9125761 unknown
InChI: InChI=1S/C15H18O3/c16-14-12-9-6-7-10(13(12)15(17)18-14)11(9)8-4-2-1-3-5-8/h9-10,12-13H,1-7H2
charge 0 multiplicity 1
36 atoms
O  -1.018469 -2.131955 0.024036
O  -1.153213 -1.85284 -2.289816
O  -1.123025 -1.804654 2.333146
C  -0.95991 1.154849 -1.155051
C  -0.953314 1.179048 1.14055
C  -1.929854 -0.025961 -0.773286
C  -1.92306 -0.011005 0.78932
C  0.055942 1.066673 -0.009238
C  -1.712497 2.479137 -0.80739
C  -1.709519 2.494612 0.769567
C  1.403873 0.896106 -0.01189
C  -1.357619 -1.383155 -1.167544
C  -1.342986 -1.358877 1.204088
C  2.232259 0.764745 1.259856
C  2.222522 0.730521 -1.286078
C  2.997195 -0.59094 1.27973
C  2.98585 -0.626254 -1.274966
C  3.847975 -0.773026 0.000849
H  -0.589079 1.091272 -2.187246
H  -0.576284 1.137323 2.171637
H  -2.922945 0.099339 -1.236787
H  -2.912719 0.119688 1.258731
H  -2.732378 2.50146 -1.232447
H  -1.15996 3.343816 -1.21344
H  -1.157344 3.368274 1.156468
H  -2.727814 2.523638 1.19809
H  2.980122 1.585886 1.289729
H  1.607502 0.86089 2.165087
H  1.590853 0.802535 -2.188747
H  2.971022 1.549526 -1.34412
H  3.639777 -0.639837 2.179752
H  2.264349 -1.418423 1.358223
H  2.251634 -1.454827 -1.323299
H  3.620149 -0.701104 -2.179054
H  4.65395 -0.009388 -0.013655
H  4.344015 -1.762389 0.012394
