program: Gaussian 09
title: 000257689
version: EM64L-G09RevD.01
frameworkgroup: C1[X(C12H20O2)]
method: RPBEPBE
basis: SDD
operation: Freq
keyword: #pfreq=noraman
keyword: PBEPBE/SDD
title: #p freq=noraman PBEPBE/SDD
converged: YES YES NO NO
title: Mulliken charges:
elementType: O O C C C C C C C C C C C C H H H H H H H H H H H H H H H H H H H H
charge: -0.461067 -0.436130 -0.372788 -0.293242 -0.092500 -0.135267 0.351262 -0.471542 -0.476456 -0.422097 -0.440626 0.112935 -0.786519 -0.789295 0.243000 0.253419 0.227778 0.248497 0.208595 0.227994 0.225000 0.219966 0.208503 0.195316 0.234524 0.211027 0.215491 0.219467 0.235125 0.220569 0.216147 0.229334 0.344680 0.328899
chargesum: 0.00000
title: Mulliken charges with hydrogens summed into heavy atoms:
elementType: O O C C C C C C C C C C C C
charge: -0.116387 -0.107231 -0.129787 -0.039823 0.135277 0.113230 0.351262 -0.034953 -0.031490 -0.018278 0.004926 0.112935 -0.116436 -0.123245
polarizability: 1.51665495e+02 3.63754846e+00 1.24922946e+02 -9.03342419e+00 -8.19750730e-01 1.21871910e+02
1716.lowfreq: -14.9751 -10.1148 0.0005 0.0006 0.0006 7.3287 46.1513 60.6775 83.4086
frequency: 45.9006 60.6702 83.3942 105.6692 119.2988 129.6040 143.5380 171.4544 183.1356 212.3817 254.9405 276.2307 282.8259 297.5215 322.2372 339.6723 388.0114 420.3496 440.9479 451.6475 540.2906 558.2850 598.0529 691.0869 745.0342 770.6197 826.9319 845.3811 874.9751 881.1880 915.8939 925.0648 938.7846 947.0173 963.2366 973.3736 985.1495 1005.5738 1015.9436 1041.3538 1056.2808 1074.0906 1079.0273 1096.0934 1102.9249 1112.0567 1132.1458 1147.9726 1170.9811 1181.0050 1192.2074 1210.9445 1227.5088 1231.9555 1243.5682 1251.7895 1267.0642 1286.9658 1294.1137 1305.9274 1322.7298 1332.8239 1358.4284 1367.9952 1384.5520 1395.7312 1404.1998 1457.5528 1464.7349 1465.9873 1471.6748 1473.4191 1474.8853 1476.8270 1496.4885 1737.7517 2930.1898 2956.0317 2960.2687 2970.1348 2976.5527 2981.9643 2997.1783 3001.7947 3017.5787 3022.7345 3025.5539 3052.5669 3060.9215 3070.0408 3079.3244 3089.4549 3091.4461 3096.7498 3560.5175 3570.5735
redmass: 4.3512 3.9194 3.9019 2.6361 2.0641 1.2222 2.7690 1.1923 2.6916 2.5139 2.0211 1.2886 1.5253 1.9710 2.5400 2.5147 2.8997 3.6572 2.6407 3.2900 2.8094 3.3810 3.3549 4.8888 4.1248 2.0111 1.7311 3.1800 2.5773 2.4124 2.6912 1.9528 2.9170 1.5165 2.2152 1.8583 2.0748 2.3001 1.8141 1.7497 2.1695 1.7855 1.6313 1.4950 2.1015 2.0749 1.3290 1.4047 1.5074 1.3896 1.2423 1.2997 1.6814 1.3205 2.4626 1.8316 1.3280 1.4497 1.3900 1.5413 1.2797 1.3538 1.4060 1.2485 1.2558 1.2132 1.4485 1.0497 1.0805 1.0484 1.0477 1.0756 1.0784 1.0783 1.0853 8.3531 1.0543 1.0386 1.0385 1.0832 1.0948 1.0682 1.0599 1.0937 1.0627 1.0971 1.0965 1.1015 1.0913 1.0992 1.1033 1.0953 1.0931 1.0926 1.0660 1.0665
irintensity: 0.8179 0.6485 2.4764 1.1176 2.3237 0.2954 3.4085 1.3139 1.8173 4.1427 60.9387 72.1695 87.8466 47.7050 28.0661 20.3661 5.6950 1.7956 2.0194 6.6998 21.3897 0.8703 2.5805 2.0314 5.0331 2.5146 9.3720 2.4714 3.6534 15.5963 4.8214 11.5492 74.2653 4.6414 29.5359 19.8825 8.1764 12.6045 3.5973 6.6731 4.2422 15.1179 0.6202 12.3619 9.9371 17.1925 4.2814 29.1280 19.0134 3.5447 5.5509 18.4139 5.9025 4.2292 0.8343 0.8576 3.8502 5.6520 4.3303 2.4221 4.3265 7.9825 3.3613 19.2331 27.0969 5.5749 0.7908 0.0697 5.4537 11.3453 16.6506 8.3380 8.8108 4.2677 12.2096 0.8271 55.7020 27.0560 92.6413 17.8884 19.2883 25.6415 25.1417 104.9027 57.7367 3.3391 53.1711 14.4070 33.9396 38.0060 57.3443 13.6972 48.9469 27.3807 5.5549 1.7335
temp: 298.150 k
press: 1.00000 atm
elementType: 8 8 6 6 6 6 6 6 6 6 6 6 6 6 1 1 1 1 1 1 1 1 1 1 1 1 1 1 1 1 1 1 1 1
symmnumber: 1
zpe: 777779.9 jmol-1
zpe.correction: 0.296241 hartree
zpe.thermalcorrener: 0.311688 hartree
zpe.thermalcorrenthalpy: 0.312633 hartree
zpe.thermalcorrgfe: 0.254113 hartree
zpe.sumelectzpe: -618.562330 hartree
zpe.sumelectthermal: -618.546883 hartree
zpe.sumelectthermalent: -618.545939 hartree
zpe.sumelectthermalfe: -618.604458 hartree
dipole: 2.2717 3.0145 -0.4902
dipole: 3.8063
quadrupole: -92.3736 -83.4599 -80.5816
quadrupole: -5.5253 -0.2508 -2.6115
quadrupole: -6.9019 2.0118 4.8901 -5.5253 -0.2508 -2.6115
hfenergy: -618.8585712 hartree
pointgroup: C01 [X(C12H20O2)]
dipole: -0.8605929 -1.2079395 -0.2068747 debye
polarizability: 151.3426181|4.272363|125.120102|9.217418|1.1096346|121.9976305 unknown
InChI: InChI=1S/C12H20O2/c1-7(2)12-8-3-4-9(12)11(6-14)10(8)5-13/h8-11,13-14H,3-6H2,1-2H3
charge 0 multiplicity 1
34 atoms
O  2.155989 -2.547434 -0.673882
O  2.843647 1.871535 -1.227359
C  -0.516164 -0.54829 1.2268
C  -0.033575 1.191673 -0.183032
C  0.870716 -0.96025 0.6219
C  1.166253 0.204764 -0.404483
C  -1.164694 0.178993 0.040672
C  -0.266408 0.646032 2.204964
C  0.055498 1.844952 1.232373
C  0.837013 -2.338529 -0.041733
C  2.581904 0.779967 -0.26761
C  -2.350201 -0.011187 -0.596917
C  -2.803061 0.850675 -1.766226
C  -3.339611 -1.09719 -0.198993
H  -1.071753 -1.384391 1.68129
H  -0.151204 1.919993 -0.998385
H  1.642468 -0.983871 1.417032
H  1.073873 -0.207899 -1.430865
H  0.561867 0.430834 2.905138
H  -1.171032 0.852507 2.804416
H  -0.701215 2.643883 1.327158
H  1.040399 2.304046 1.423801
H  0.028154 -2.369721 -0.804017
H  0.643559 -3.12591 0.719098
H  3.317885 -0.040841 -0.391008
H  2.741873 1.24623 0.719232
H  -2.990288 0.229407 -2.665224
H  -3.75933 1.360109 -1.531471
H  -2.062364 1.622092 -2.031782
H  -4.316131 -0.654094 0.082385
H  -3.539313 -1.780017 -1.049503
H  -2.984803 -1.70355 0.650452
H  2.178004 -3.438454 -1.104061
H  2.772545 1.499035 -2.142559
