program: Gaussian 09
title: 000023286
version: EM64L-G09RevD.01
frameworkgroup: C1[X(C6H13NO)]
method: RPBEPBE
basis: SDD
operation: Freq
keyword: #p
keyword: freq=noraman
keyword: PBEPBE/SDD
title: #p freq=noraman PBEPBE/SDD
converged: NO YES NO NO
title: Mulliken charges:
elementType: O N C C C C C C H H H H H H H H H H H H H
charge: -0.444690 -0.556176 -0.119034 -0.107513 -0.429568 -0.435649 -0.388659 -0.386468 0.198382 0.216279 0.181265 0.228919 0.180379 0.221666 0.201711 0.193390 0.202867 0.196590 0.251434 0.273400 0.321477
chargesum: 0.00000
title: Mulliken charges with hydrogens summed into heavy atoms:
elementType: O N C C C C C C
charge: -0.123214 -0.031343 0.079348 0.108766 -0.019384 -0.033604 0.006442 0.012988
polarizability: 7.95971430e+01 -4.34222388e-01 7.38861202e+01 -5.22329726e-01 -2.75481044e+00 6.40013816e+01
1716.lowfreq: -28.9053 -0.0010 -0.0009 -0.0009 16.1438 28.3222 124.8652 181.7512 248.5834
frequency: 124.8406 181.7437 248.5729 267.8655 308.8349 320.8570 349.0831 354.3108 423.8727 442.0898 509.1224 547.8876 715.7596 769.9739 833.4198 843.1319 873.4922 905.6203 939.9424 999.6868 1022.2390 1047.5023 1073.0261 1088.6479 1111.6427 1142.3734 1190.7810 1200.8015 1205.8585 1255.0069 1271.2698 1288.4033 1326.4765 1333.9508 1334.8764 1340.6834 1347.5862 1361.9444 1367.8316 1461.3582 1463.0386 1467.4524 1474.0148 1643.6746 2933.7215 2950.1235 2955.1809 2972.5064 2973.2390 3018.8867 3034.5927 3038.6792 3045.4284 3050.0270 3412.0967 3532.3824 3534.6746
redmass: 3.1508 2.1409 2.2981 1.3961 1.5356 1.2758 1.7281 3.7398 3.4070 3.2958 3.0622 1.8195 1.4957 1.8192 1.8438 1.9019 2.1419 1.6640 2.3779 2.9055 1.5801 1.3141 1.3235 2.0117 2.3525 2.4668 1.4682 1.5830 1.4671 1.2874 1.3181 1.3328 1.3074 1.3463 1.3976 1.5019 1.5196 1.2920 1.3472 1.0898 1.0891 1.0801 1.0939 1.0892 1.0808 1.0667 1.0685 1.0648 1.0598 1.0854 1.0971 1.0976 1.0954 1.1004 1.0446 1.0658 1.0953
irintensity: 0.6202 1.1472 18.5060 85.6398 24.4070 46.7813 19.0659 10.6629 3.7451 3.8172 1.0824 2.3470 237.8280 25.9171 3.1017 28.3354 8.4592 14.6225 9.7454 77.8432 6.5956 1.2137 8.1237 1.4170 1.9329 11.7259 5.9497 8.0846 2.8741 1.3302 8.2732 4.6942 0.7334 1.1130 0.4710 0.3126 2.3278 22.0676 13.1519 5.6488 8.3035 20.2563 5.6085 43.4645 10.0317 31.3747 49.6673 32.1183 40.7095 30.7724 51.9907 57.1787 7.3259 114.0417 1.5070 4.4636 1.1988
temp: 298.150 k
press: 1.00000 atm
elementType: 8 7 6 6 6 6 6 6 1 1 1 1 1 1 1 1 1 1 1 1 1
symmnumber: 1
zpe: 491857.1 jmol-1
zpe.correction: 0.187338 hartree
zpe.thermalcorrener: 0.195756 hartree
zpe.thermalcorrenthalpy: 0.196700 hartree
zpe.thermalcorrgfe: 0.155217 hartree
zpe.sumelectzpe: -365.736545 hartree
zpe.sumelectthermal: -365.728127 hartree
zpe.sumelectthermalent: -365.727183 hartree
zpe.sumelectthermalfe: -365.768666 hartree
dipole: -1.8331 0.4838 -0.1879
dipole: 1.9051
quadrupole: -52.9326 -55.1247 -46.7061
quadrupole: 0.0025 -0.6319 -5.2508
quadrupole: -1.3448 -3.5369 4.8817 0.0025 -0.6319 -5.2508
hfenergy: -365.9238836 hartree
pointgroup: C01 [X(C6H13N1O1)]
dipole: -0.7231277 -0.1801241 0.0803016 debye
dipolederiv: -0.7822259 0.1329601 -0.144306 0.1456182 -0.7379866 0.0191849 -0.1713867 0.0028395 -0.1449542 -0.5843079 -0.251631 0.0428833 -0.2743826 -0.7112869 -0.1014979 -0.0288437 -0.2040574 -0.2656532 0.3552238 0.1924662 -0.1028774 0.1956338 0.2521727 0.0208767 -0.0901531 -0.0250503 0.2672138 0.4793018 -0.1633451 0.1022351 -0.1988237 0.3816589 -0.0539468 0.0696094 -0.0657051 0.2640479 -0.0215727 -0.0344445 0.0156316 0.0113924 0.0282836 0.0206984 -0.0033873 -0.0379035 0.170984 -0.1354181 0.0357268 -0.0112634 -0.0581284 -0.0249913 0.0401624 0.015685 -0.0109667 0.1521895 0.0675749 -0.0136326 0.0123605 0.0004114 0.0568406 -0.0193947 -0.020518 -0.0020913 0.1503139 0.0801982 0.0181799 -0.0170276 -0.019182 0.0551928 -0.0236195 0.0255988 -0.0044525 0.150425 0.0184917 -0.0154359 0.0205565 -0.0232274 -0.008178 0.0727037 0.019558 0.0505674 -0.2031954 0.0172133 0.0143946 0.0000062 0.0077825 0.0265696 0.0418914 -0.001031 0.0214447 -0.1546591 0.0180464 -0.0076365 0.0306186 0.0034863 0.0766213 -0.0003821 0.0113568 0.0718071 -0.1970345 0.0537486 -0.0171072 -0.0071663 0.0048082 -0.1684628 -0.0630113 -0.0004278 -0.0851435 0.049729 0.018792 0.0116264 -0.0392544 -0.0015163 0.0769104 -0.0079774 -0.0153302 0.0677142 -0.194141 0.0381411 -0.0041553 0.0022844 -0.0230514 -0.1864925 -0.0636554 0.0033749 -0.0844583 0.0491933 -0.1467435 0.113351 -0.0395015 0.1178685 -0.0373502 0.024887 -0.0708455 0.043512 0.0638888 0.066883 -0.0279148 -0.0172762 -0.0379448 0.0356887 0.0257459 0.0481794 -0.0124155 -0.1933823 -0.166459 -0.1048095 0.0383615 -0.1090688 -0.0245359 0.0228636 0.0710952 0.0396564 0.0639765 0.0725158 0.027 0.0189755 0.0348632 0.0350401 0.023524 -0.0477494 -0.012063 -0.1912952 0.1620201 0.0158806 -0.05349 0.0190525 0.3086328 -0.0203627 0.0233916 0.1109259 -0.0381566 0.0931281 0.0827494 0.0264615 0.192655 0.2204203 0.0599891 0.1001832 0.0869142 0.2157804 0.2954484 -0.0042225 0.1217882 0.0117534 0.3452524 -0.0186793 0.0616402 0.0489257 -0.0152707 unknown
polarizability: 79.606599|0.3857125|73.6916016|0.4678719|-3.0695087|64.1864441 unknown
InChI: InChI=1S/C6H13NO/c7-5-3-1-2-4-6(5)8/h5-6,8H,1-4,7H2
charge 0 multiplicity 1
21 atoms
O  1.832033 -1.516588 0.106105
N  1.911547 1.423516 -0.121374
C  0.690956 0.692855 0.276891
C  0.620168 -0.754555 -0.286011
C  -0.568917 1.489798 -0.134954
C  -0.67164 -1.479233 0.139706
C  -1.872057 0.769856 0.281154
C  -1.924543 -0.671629 -0.281454
H  0.696579 0.606659 1.386889
H  0.693106 -0.715742 -1.389873
H  -0.560101 1.624822 -1.238902
H  -0.509899 2.499083 0.312525
H  -0.67028 -1.597863 1.24587
H  -0.685591 -2.495232 -0.297114
H  -2.750833 1.347566 -0.064007
H  -1.930428 0.730471 1.388457
H  -2.841017 -1.188339 0.061714
H  -1.975736 -0.629584 -1.388989
H  1.866291 1.758225 -1.093024
H  2.754842 0.852039 0.022333
H  1.772019 -1.705327 1.078856
