program: Gaussian 09
title: 000257687
version: EM64L-G09RevD.01
frameworkgroup: C1[X(C16H19ClN2)]
method: RPBEPBE
basis: SDD
operation: Freq
keyword: #p
keyword: freq=noraman
keyword: PBEPBE/SDD
title: #p freq=noraman PBEPBE/SDD
converged: YES YES NO NO
title: Mulliken charges:
elementType: Cl N N C C C C C C C C C C C C C C C C H H H H H H H H H H H H H H H H H H H
charge: -0.068838 -0.162399 -0.120154 -0.203483 -0.401919 0.534645 -0.372048 0.234161 -0.701578 -0.352783 -0.461393 -0.675538 -0.307486 -0.240067 -0.213479 -0.107388 -0.196407 -0.352855 -0.212868 0.176278 0.207600 0.263905 0.214087 0.206998 0.237011 0.218626 0.196833 0.300845 0.231570 0.245212 0.240420 0.211941 0.234874 0.251505 0.252524 0.231185 0.231313 0.229150
chargesum: 0.00000
title: Mulliken charges with hydrogens summed into heavy atoms:
elementType: Cl N N C C C C C C C C C C C C C C C C
charge: -0.068838 -0.162399 -0.120154 -0.027205 0.069585 0.534645 0.049037 0.234161 -0.049108 -0.051938 -0.229823 0.022035 -0.072612 0.011438 0.039045 -0.107388 0.034777 -0.121541 0.016283
polarizability: 2.45661999e+02 -1.62931343e+01 1.93659160e+02 3.20490136e+00 -1.87167700e+01 1.49079970e+02
1716.lowfreq: -11.5591 0.0005 0.0013 0.0016 4.3420 7.3305 13.3624 35.9476 45.8373
frequency: 12.9574 35.9236 45.8116 65.0863 74.1773 83.8554 110.6843 135.9506 156.7900 173.3570 185.8516 201.0122 232.5733 247.8385 259.5977 307.0301 337.2943 355.8663 399.6115 411.3354 416.6437 433.5121 447.2651 502.1035 514.2347 561.5025 578.4214 620.7726 628.1983 672.3445 705.0581 724.8981 731.0871 769.0642 776.4986 805.1538 819.4889 827.6026 845.7752 849.3062 908.4926 922.6714 943.0492 947.7637 955.9956 965.5279 978.4702 991.1570 1001.1492 1042.9215 1057.2036 1070.0076 1070.5836 1088.2066 1088.7995 1100.9013 1112.9629 1151.8038 1163.4570 1178.4498 1184.8518 1199.7041 1262.5718 1271.5759 1274.4604 1300.4439 1302.8305 1328.6839 1332.7457 1342.8591 1347.7855 1375.4450 1387.5829 1388.6528 1392.5718 1407.3683 1425.7068 1454.3103 1466.5958 1471.8164 1472.0655 1478.4999 1481.5465 1486.5505 1505.6683 1546.8903 1583.7386 1594.8133 1595.9225 2973.1468 2980.0119 2986.3144 2988.4189 2992.3574 3049.5947 3058.3324 3083.5815 3083.6364 3098.2237 3100.1509 3116.0744 3116.3586 3134.2148 3142.0262 3164.1168 3167.9768 3169.3022 3178.7595
redmass: 4.1130 4.9871 3.6734 3.6076 3.0848 4.2150 3.2416 3.0154 2.9085 4.7673 1.7386 1.2038 2.4889 3.1039 4.2986 3.4038 5.0064 2.9971 3.7893 2.9361 4.0823 4.0514 3.7935 3.5082 2.9643 3.4696 3.0023 6.5331 6.4508 5.5765 3.2375 3.0060 1.7484 2.4675 1.3265 1.3604 3.1541 1.4225 1.3804 1.3626 2.2170 2.4628 1.4112 1.4272 4.6065 2.0751 1.3410 1.3572 4.2825 2.4715 2.4538 2.4761 2.6037 1.7119 1.7333 1.9468 1.7618 1.9639 1.9704 1.2236 1.1344 2.6682 1.4373 1.3220 1.3270 1.7059 1.3152 2.5735 2.0818 1.2967 1.4036 4.8665 1.2998 1.2087 2.0147 1.8596 1.7657 1.1467 1.0477 1.6786 1.2686 1.4551 1.0893 1.2197 1.2376 5.2570 7.1855 6.1527 5.8776 1.0379 1.0819 1.0556 1.0464 1.0685 1.0970 1.0961 1.0984 1.0978 1.1010 1.0962 1.0896 1.0894 1.0890 1.0905 1.0954 1.0955 1.0932 1.0992
irintensity: 0.0376 0.8728 0.1612 0.5576 0.9821 0.8218 0.6245 0.9925 0.4671 1.2547 1.5301 0.4582 0.0467 0.5884 1.2591 1.5580 3.0225 0.4480 4.2163 0.2685 3.5707 19.5711 10.5162 12.9749 5.1174 20.5293 4.8572 0.2616 0.6358 11.8139 3.0455 6.3932 25.6438 65.0129 4.3231 52.4734 27.1048 10.5456 25.9485 1.3086 8.6724 5.4031 0.5349 2.3119 6.0375 22.6522 1.1498 0.4432 41.8053 4.6099 10.5017 4.6381 37.1856 13.7406 3.9821 16.4054 35.7606 1.0529 15.7823 18.3255 4.3473 7.0271 6.8762 6.2963 24.1850 0.5527 3.4442 100.7992 23.7278 17.1918 4.9072 1.5838 14.4778 19.6370 1.5833 64.9421 11.4959 33.2689 12.9416 46.2156 27.0191 82.5519 19.5897 55.6574 66.2555 41.8845 3.4178 32.8942 238.0400 38.4183 15.2399 48.1657 42.9150 39.7264 15.9801 24.0149 45.1936 37.5372 24.1264 27.4411 15.2166 24.1305 11.9115 12.6636 6.4914 7.2029 29.6639 12.8262
temp: 298.150 k
press: 1.00000 atm
elementType: 17 7 7 6 6 6 6 6 6 6 6 6 6 6 6 6 6 6 6 1 1 1 1 1 1 1 1 1 1 1 1 1 1 1 1 1 1 1
symmnumber: 1
zpe: 819728.9 jmol-1
zpe.correction: 0.312218 hartree
zpe.thermalcorrener: 0.330805 hartree
zpe.thermalcorrenthalpy: 0.331749 hartree
zpe.thermalcorrgfe: 0.263381 hartree
zpe.sumelectzpe: -1189.261727 hartree
zpe.sumelectthermal: -1189.243141 hartree
zpe.sumelectthermalent: -1189.242196 hartree
zpe.sumelectthermalfe: -1189.310565 hartree
dipole: -2.9699 -1.8810 1.4618
dipole: 3.8072
quadrupole: -128.2863 -110.8417 -118.0142
quadrupole: -7.4638 -4.3050 -5.6451
quadrupole: -9.2389 8.2057 1.0332 -7.4638 -4.3050 -5.6451
hfenergy: -1189.5739457 hartree
pointgroup: C01 [X(C16H19Cl1N2)]
dipole: -1.2580884 0.737408 -0.342165 debye
polarizability: 242.0781907|16.2811852|197.9293701|-14.3992733|-17.1357304|148.3935682 unknown
InChI: InChI=1S/C16H19ClN2/c1-3-15(13-8-10-14(17)11-9-13)19(4-2)16-7-5-6-12-18-16/h5-12,15H,3-4H2,1-2H3
charge 0 multiplicity 1
38 atoms
Cl 5.401629 -0.917571 -1.160893
N  -1.233472 0.985666 -0.291679
N  -1.490216 -1.083538 0.857639
C  -0.06647 1.42506 0.550713
C  -0.291608 1.33549 2.086069
C  1.276367 0.812644 0.118972
C  -1.549559 1.838855 -1.463766
C  -1.925587 -0.214622 -0.119365
C  -1.57499 2.050539 2.552766
C  1.581373 -0.559067 0.324432
C  2.260249 1.641578 -0.4774
C  -0.979571 1.311924 -2.802544
C  -3.070257 -0.548648 -0.925472
C  2.829766 -1.090752 -0.065629
C  3.518614 1.129228 -0.870505
C  3.780393 -0.236273 -0.657896
C  -3.759111 -1.74704 -0.67907
C  -2.180955 -2.236267 1.074855
C  -3.322993 -2.623366 0.345641
H  0.006549 2.510041 0.33422
H  0.594175 1.807863 2.556559
H  -0.312462 0.280748 2.398204
H  -2.645799 1.975333 -1.54041
H  -1.134906 2.842234 -1.262865
H  -2.474287 1.56753 2.131855
H  -1.658902 2.018618 3.654411
H  -1.583843 3.114595 2.245001
H  0.821002 -1.202467 0.778566
H  2.051396 2.707423 -0.635694
H  0.12134 1.249274 -2.75836
H  -1.366949 0.304523 -3.03427
H  -1.258752 1.988381 -3.631918
H  -3.418143 0.111216 -1.722878
H  3.059556 -2.148998 0.090596
H  4.273328 1.77607 -1.327008
H  -4.633823 -1.999067 -1.289281
H  -1.783097 -2.877161 1.87164
H  -3.835284 -3.565099 0.559961
