program: Gaussian 09
title: 000257675
version: EM64L-G09RevD.01
frameworkgroup: C1[X(C20H16)]
method: RPBEPBE
basis: SDD
operation: Freq
keyword: #p
keyword: freq=noraman
keyword: PBEPBE/SDD
title: #p freq=noraman PBEPBE/SDD
converged: NO YES NO NO
title: Mulliken charges:
elementType: C C C C C C C C C C C C C C C C C C C C H H H H H H H H H H H H H H H H
charge: 0.272018 0.321209 0.165163 0.054038 0.249841 0.251984 0.482601 -0.765009 -0.471509 -0.460172 0.322459 -0.373306 -0.834024 -0.409726 -0.465925 -0.463707 -0.262695 -0.838999 -0.259920 -0.252353 0.227237 0.246621 0.240527 0.223333 0.237691 0.237922 0.237935 0.224095 0.246401 0.232701 0.225273 0.232437 0.232439 0.238438 0.225838 0.229144
chargesum: 0.00000
title: Mulliken charges with hydrogens summed into heavy atoms:
elementType: C C C C C C C C C C C C C C C C C C C C
charge: 0.272018 0.321209 0.165163 0.054038 0.249841 0.251984 0.482601 -0.537772 -0.224888 -0.219645 0.322459 -0.149973 -0.120475 -0.185631 -0.219524 -0.231006 -0.037422 -0.135685 -0.034083 -0.023209
polarizability: 4.13353355e+02 1.74740074e+00 2.38838110e+02 -4.28989815e-03 -4.39381508e-04 9.05318778e+01
1716.lowfreq: -0.0008 -0.0003 0.0006 6.4589 12.2300 18.4266 46.5197 64.8609 91.5455
frequency: 46.5114 64.8324 91.5345 140.4568 148.9520 156.5994 172.2169 200.8776 221.2837 262.6898 284.2205 304.0571 308.7068 343.0263 401.3615 423.6916 469.0946 472.3347 483.5102 504.7371 519.4906 530.0618 549.6719 573.7331 582.0421 598.0695 600.6951 657.0883 706.2041 723.0912 754.1313 768.8837 778.4595 792.6815 827.9175 831.5936 844.1227 859.7508 862.8259 899.6332 907.9753 930.0824 953.2020 963.9161 978.0989 979.9919 988.6766 1009.3181 1020.2284 1038.4173 1044.3974 1059.3800 1078.3647 1092.4881 1157.5261 1171.2984 1184.1313 1188.6885 1234.1573 1245.3747 1253.0032 1257.1439 1272.1099 1324.9598 1343.8885 1376.0814 1387.4413 1396.4593 1400.9938 1403.2383 1412.5188 1427.4166 1439.9562 1458.0205 1472.1369 1473.1266 1481.2921 1481.8317 1499.6080 1504.8556 1549.3124 1572.4395 1593.0566 1609.5721 1621.7226 1629.6853 2970.0514 2979.5997 3045.1540 3047.5679 3081.5615 3116.0280 3117.3251 3121.0079 3131.3153 3136.6278 3139.4404 3144.3159 3150.7980 3163.6428 3165.1855 3165.8594
redmass: 3.7734 4.1170 2.1382 2.9498 1.3618 4.5375 1.1507 2.8310 3.4380 3.7795 4.1091 3.5170 5.3593 3.0328 4.5021 3.2434 4.5174 3.1997 5.7800 4.5881 3.5058 2.8274 4.7854 6.4309 2.9443 3.5208 5.7853 5.9771 2.5889 5.9475 1.3192 1.5497 4.3878 1.8538 2.1747 4.1798 1.9022 4.2744 1.6283 4.2645 1.4071 2.2725 2.7235 1.4271 1.3462 1.3385 1.3557 1.8521 2.6044 1.6260 1.5654 1.9838 2.8905 1.8258 1.8051 1.3237 1.2085 1.4168 1.5904 1.8953 1.7669 1.7655 2.1408 2.8679 3.8821 2.9426 3.1977 1.5712 1.4468 1.7704 2.5284 3.0188 4.5836 2.5443 1.0465 1.6084 1.0455 1.1688 2.0222 2.8217 5.4616 7.5597 5.5631 6.0075 6.5993 6.2702 1.0377 1.0416 1.0975 1.0974 1.0980 1.0919 1.0879 1.0868 1.0888 1.0910 1.0857 1.0911 1.0942 1.0959 1.0965 1.0977
irintensity: 0.3538 0.3963 0.0352 2.2156 0.2502 0.3774 1.8056 0.2866 1.0489 0.0585 1.2479 6.2578 0.4039 1.0808 0.0394 2.5152 1.1283 3.2070 1.2133 4.9003 0.8334 7.2955 7.4294 2.3539 3.4621 0.1321 1.2807 2.5398 2.5154 0.1935 72.9699 29.3456 1.7674 5.5961 0.0080 0.5072 69.7177 5.1532 14.2283 3.8341 0.2297 9.7359 0.3821 4.7608 1.0122 0.1145 0.6424 2.8707 9.3788 2.0138 6.3041 2.1530 0.5450 9.7991 2.9827 1.5663 0.2209 0.1912 2.9526 9.6077 3.3595 8.1897 0.2022 1.7403 10.7374 0.0133 1.0296 12.4998 27.7216 0.0349 2.6368 2.7724 0.6978 6.5471 14.2667 7.2979 12.4885 17.2885 5.3845 39.5116 6.5028 6.3825 5.3546 3.2751 1.8895 2.7917 41.8726 32.6470 19.4373 17.6163 23.5549 14.3340 5.8458 9.8208 3.5001 23.1822 0.6347 8.9698 32.3376 43.5212 34.4985 32.3581
temp: 298.150 k
press: 1.00000 atm
elementType: 6 6 6 6 6 6 6 6 6 6 6 6 6 6 6 6 6 6 6 6 1 1 1 1 1 1 1 1 1 1 1 1 1 1 1 1
symmnumber: 1
zpe: 767427.8 jmol-1
zpe.correction: 0.292298 hartree
zpe.thermalcorrener: 0.307949 hartree
zpe.thermalcorrenthalpy: 0.308893 hartree
zpe.thermalcorrgfe: 0.250003 hartree
zpe.sumelectzpe: -770.417385 hartree
zpe.sumelectthermal: -770.401734 hartree
zpe.sumelectthermalent: -770.400790 hartree
zpe.sumelectthermalfe: -770.459680 hartree
dipole: 0.3530 0.7299 0.0006
dipole: 0.8108
quadrupole: -99.4173 -100.5422 -125.3139
quadrupole: 0.3288 0.0013 0.0002
quadrupole: 9.0071 7.8823 -16.8894 0.3288 0.0013 0.0002
hfenergy: -770.709683 hartree
pointgroup: C01 [X(C20H16)]
dipole: 0.137093 -0.2880264 -0.0013077 debye
polarizability: 413.3227359|-2.8240856|238.8654637|-0.8762409|0.3704655|90.5351439 unknown
InChI: InChI=1S/C20H16/c1-13-6-5-9-19-16(13)10-11-18-14(2)17-8-4-3-7-15(17)12-20(18)19/h3-12H,1-2H3
charge 0 multiplicity 1
36 atoms
C  0.170559 0.271601 0.00064
C  -0.238611 -1.126521 -0.001694
C  1.604733 0.615914 -0.002399
C  -1.619202 -1.494347 0.001082
C  2.59214 -0.43339 -0.00774
C  -2.626333 -0.471812 0.006191
C  -2.213084 0.92584 0.008512
C  -0.834125 1.257893 0.005712
C  0.80085 -2.138854 -0.007005
C  2.140697 -1.811089 -0.009887
C  3.997216 -0.116539 -0.010987
C  2.054738 1.969712 -0.000264
C  -1.987944 -2.970807 -0.001518
C  -4.044117 -0.743556 0.009208
C  -3.211135 1.963642 0.013612
C  4.389543 1.233687 -0.008687
C  3.422493 2.274519 -0.00331
C  5.052563 -1.209744 -0.017021
C  -4.984867 0.284206 0.014125
C  -4.568007 1.657474 0.016373
H  -0.572986 2.320953 0.007621
H  0.512242 -3.193824 -0.008841
H  2.888534 -2.610238 -0.013945
H  1.333828 2.792101 0.003782
H  -3.074309 -3.135889 0.00079
H  -1.583051 -3.484242 -0.894219
H  -1.578637 -3.488493 0.886705
H  -4.400569 -1.777406 0.007606
H  -2.875948 3.008037 0.015278
H  5.456899 1.484917 -0.011136
H  3.749992 3.320173 -0.001599
H  4.973824 -1.864467 0.872026
H  4.968131 -1.859964 -0.90884
H  6.064447 -0.770393 -0.01913
H  -6.054685 0.046685 0.016313
H  -5.320718 2.453419 0.020241
