program: Gaussian 09
title: 000257674
version: EM64L-G09RevD.01
frameworkgroup: C1[X(C5H11ClN2O2)]
method: RPBEPBE
basis: SDD
operation: Freq
keyword: #p
keyword: freq=noraman
keyword: PBEPBE/SDD
title: #p freq=noraman PBEPBE/SDD
converged: YES YES NO NO
title: Mulliken charges:
elementType: Cl O O N N C C C C C H H H H H H H H H H H
charge: -0.086756 -0.268154 -0.310846 -0.376667 -0.103208 -0.334474 0.296789 -0.541989 -0.599959 -0.484150 0.262773 0.242923 0.341258 0.264402 0.278024 0.275022 0.233696 0.221256 0.232441 0.235015 0.222604
chargesum: 0.00000
title: Mulliken charges with hydrogens summed into heavy atoms:
elementType: Cl O O N N C C C C C
charge: -0.086756 -0.268154 -0.310846 -0.035409 -0.103208 0.171222 0.296789 0.000437 0.130015 0.205911
polarizability: 9.95668967e+01 -1.73492572e+00 9.90599531e+01 -4.50129532e+00 4.30422168e+00 5.91422617e+01
1716.lowfreq: -6.2666 -4.4194 0.0013 0.0023 0.0035 7.4366 20.8643 36.7683 79.1237
frequency: 20.6119 36.7269 79.1105 94.8663 117.2754 147.7676 157.1538 175.0573 193.8317 269.4430 334.3852 364.0754 403.2149 452.5345 511.2477 559.3007 598.7561 643.5833 688.6219 753.4539 839.4009 913.0017 951.8446 974.7618 1028.4316 1077.4107 1105.7309 1109.3312 1144.1800 1149.3967 1160.4060 1186.3723 1242.6956 1291.7404 1315.2996 1369.3986 1403.5162 1416.5177 1439.2708 1442.6851 1444.6238 1463.9942 1470.7908 1479.9038 1505.1915 1616.8489 2975.5402 2978.6791 2996.5325 3053.7761 3063.8311 3070.2443 3081.4082 3115.3925 3120.4795 3151.0280 3552.3983
redmass: 4.6349 4.4361 3.5346 3.3852 3.5729 1.6780 1.5117 1.3822 3.3971 3.5221 3.1136 3.1193 3.9685 3.5340 4.3111 4.3536 4.1607 1.1643 9.8142 3.7436 2.1136 3.2250 4.4863 2.4246 1.7726 4.3521 1.4827 1.2543 1.7394 1.5872 1.3146 1.7988 1.3335 1.6523 1.6690 1.3579 1.1461 1.1389 1.1015 1.0983 1.0565 1.0480 1.0843 1.1322 1.8392 7.9407 1.0366 1.0292 1.0591 1.0881 1.0711 1.0983 1.1057 1.1034 1.0991 1.1117 1.0765
irintensity: 2.2244 4.1914 0.5714 16.1253 2.8467 0.5579 1.2382 3.2751 2.7544 17.3012 8.2340 28.8305 18.7949 0.9221 3.0360 18.2052 7.8476 118.5642 44.9567 16.6358 5.5797 43.4665 11.7759 15.2480 6.7227 3.2563 61.2972 0.2983 5.5305 5.7952 13.0285 22.5872 47.0270 18.7184 96.0808 11.9123 15.4133 4.2874 7.7223 22.8426 13.6036 28.6748 23.9076 71.3031 344.9040 213.7647 61.5510 44.8335 37.3924 6.7442 22.7039 31.9884 39.7435 18.7191 5.3444 16.9596 36.8303
temp: 298.150 k
press: 1.00000 atm
elementType: 17 8 8 7 7 6 6 6 6 6 1 1 1 1 1 1 1 1 1 1 1
symmnumber: 1
zpe: 438449.7 jmol-1
zpe.correction: 0.166997 hartree
zpe.thermalcorrener: 0.179416 hartree
zpe.thermalcorrenthalpy: 0.180360 hartree
zpe.thermalcorrgfe: 0.126142 hartree
zpe.sumelectzpe: -916.284471 hartree
zpe.sumelectthermal: -916.272052 hartree
zpe.sumelectthermalent: -916.271108 hartree
zpe.sumelectthermalfe: -916.325326 hartree
dipole: 0.6791 1.8659 -0.0192
dipole: 1.9857
quadrupole: -62.9217 -68.7015 -67.6494
quadrupole: 11.4554 -1.0300 -3.3228
quadrupole: 3.5025 -2.2773 -1.2252 11.4554 -1.0300 -3.3228
hfenergy: -916.4514678 hartree
pointgroup: C01 [X(C5H11Cl1N2O2)]
dipole: -0.3688673 0.6866931 0.0522575 debye
dipolederiv: -0.2808371 -0.0665483 -0.0178299 -0.1701073 -0.5460637 -0.0065419 -0.0086624 0.0464879 -0.2097213 -0.5102286 0.0676071 0.0260923 0.0595095 -0.6538966 -0.1190932 0.007258 0.0766239 -0.2254727 -0.708062 0.0999894 0.0529033 0.036321 -1.1089393 0.1528651 0.1088165 0.1864142 -0.4471882 -1.3247111 -0.1768892 0.2056256 -0.2585726 -0.4568556 0.0381548 0.2801891 0.0013301 -0.5835538 -0.7949195 0.2666763 0.0756486 0.3161232 -0.0620895 -0.1672705 0.3881565 -0.4134975 -0.3297331 0.6788546 -0.0225876 -0.0770692 -0.3732642 -0.0605146 0.1039813 -0.0129056 0.0816539 0.2448169 1.8418731 -0.3020139 -0.4611004 -0.0612434 1.3267564 -0.2576948 -0.6132245 -0.1869633 0.496197 0.1557457 0.13044 -0.0079068 0.2185203 0.7204359 -0.0993233 -0.037586 -0.0590314 0.1437745 0.4350157 0.1019744 0.0515268 0.1270778 -0.0109064 0.0787896 -0.1044063 0.1376762 0.2629513 0.2935671 -0.0270853 -0.0037575 -0.0760575 0.463472 0.1327091 -0.0640361 0.240943 0.298104 0.117434 -0.0846518 -0.0216086 0.0851813 -0.000436 0.0029638 -0.0853501 0.0084532 0.1206539 -0.0666421 0.0086885 0.0609086 0.0223334 0.1324878 0.0354838 0.0812068 -0.0228798 -0.1159541 0.2633066 -0.0316233 0.028786 0.0212906 0.1819214 0.0530795 0.083058 0.0496419 0.3085299 -0.1348049 0.0450928 0.0170624 0.0406644 -0.0536828 0.0194979 0.0135044 -0.0044357 0.1045432 0.094441 -0.0326096 0.0672725 -0.0440695 -0.0338625 0.0234878 0.0251711 0.012659 -0.0729225 0.1380678 0.0252262 -0.0314213 -0.0259185 -0.0051479 0.0604339 -0.0171312 0.0533738 0.1089616 -0.0840465 -0.0311178 -0.0384963 -0.0487048 0.1169362 0.0021281 -0.158308 -0.0456826 -0.1158298 -0.069137 0.0311295 0.0665319 0.1164434 0.0444541 -0.1095591 0.088666 -0.0855052 0.0103869 0.1199494 -0.009345 0.0051445 0.0236737 -0.1025394 0.0588006 0.0012509 0.0841996 0.0212346 -0.0646282 -0.0231192 -0.1203301 0.0266558 0.0530315 0.000798 -0.0895978 -0.0764437 -0.0142738 -0.100238 0.030767 0.1220177 -0.0358568 0.055439 -0.0036905 0.1139306 -0.0850175 -0.0055043 unknown
polarizability: 98.2144535|1.5013315|99.7762033|-6.8733787|-4.1240947|59.7784546 unknown
InChI: InChI=1S/C5H11ClN2O2/c1-8(10-2)5(9)7-4-3-6/h7H,3-4H2,1-2H3
charge 0 multiplicity 1
21 atoms
Cl 3.275384 1.608221 -0.135904
O  -1.581319 1.188879 -0.442797
O  -0.360183 -2.100562 0.426836
N  0.635127 -0.210735 -0.555831
N  -1.574749 -0.104942 0.267496
C  1.952377 -0.821079 -0.697789
C  -0.41203 -0.889513 0.044316
C  2.998772 -0.232725 0.251957
C  -2.900908 -0.737304 0.312729
C  -1.60692 2.286325 0.554631
H  1.838513 -1.897397 -0.463358
H  2.3053 -0.731844 -1.741947
H  0.463584 0.737984 -0.89392
H  3.985016 -0.704262 0.124761
H  2.673993 -0.261437 1.301883
H  -2.765348 -1.740069 0.747463
H  -3.341747 -0.831561 -0.698651
H  -3.577967 -0.149672 0.955435
H  -1.59593 3.208053 -0.049912
H  -0.720582 2.24032 1.212136
H  -2.529782 2.242523 1.160665
