program: Gaussian 09
title: 000257673
version: EM64L-G09RevD.01
frameworkgroup: C1[X(C5H9ClN4O3)]
method: RPBEPBE
basis: SDD
operation: Freq
keyword: #p
keyword: freq=noraman
keyword: PBEPBE/SDD
title: #p freq=noraman PBEPBE/SDD
converged: YES YES NO NO
title: Mulliken charges:
elementType: Cl O O O N N N N C C C C C H H H H H H H H H
charge: -0.074594 -0.230847 -0.192441 -0.231801 -0.394214 -0.473560 -0.166834 0.036046 -0.327448 -0.551552 0.324806 0.371309 -0.619768 0.269495 0.251089 0.311586 0.283368 0.272285 0.343805 0.278404 0.260994 0.259870
chargesum: 0.00000
title: Mulliken charges with hydrogens summed into heavy atoms:
elementType: Cl O O O N N N N C C C C C
charge: -0.074594 -0.230847 -0.192441 -0.231801 -0.082628 -0.129754 -0.166834 0.036046 0.193135 0.004101 0.324806 0.371309 0.179500
polarizability: 1.37150506e+02 4.05425861e+00 1.22945647e+02 -6.61056761e+00 8.00055494e+00 6.25138419e+01
1716.lowfreq: -4.3650 -0.0015 0.0025 0.0025 2.8076 6.3189 13.7959 38.2989 48.1395
frequency: 13.5691 38.2917 48.1163 70.9565 93.1556 114.3773 128.0816 141.2215 202.7095 225.3186 251.3750 287.3413 317.2744 363.5181 386.5449 393.8396 453.6185 497.6216 538.1930 594.7542 675.6537 688.6822 716.3016 753.6121 784.3157 811.1062 869.7938 916.3215 934.3281 989.3507 1026.0210 1089.2546 1116.3513 1142.5635 1168.1102 1188.2993 1206.8245 1236.5024 1271.3832 1300.1110 1369.3286 1371.0027 1417.0312 1440.6141 1446.6545 1462.3800 1468.9932 1480.3460 1491.1533 1655.4625 1710.7096 3003.8857 3007.5155 3060.9427 3070.6902 3093.4180 3149.1891 3156.3859 3407.6967 3533.6598
redmass: 7.9495 8.3795 7.1340 3.9966 4.9323 6.7498 1.2520 2.8872 7.4790 7.3174 6.3107 3.1794 4.1680 3.2714 6.7461 6.2980 2.5292 6.8340 1.4142 4.2743 5.6613 10.0783 3.8185 3.6217 1.4784 3.1854 2.9880 2.8809 3.3647 2.6646 1.7891 3.9570 1.3276 2.1003 1.4824 2.6054 1.9555 1.3623 4.0702 1.2034 1.7302 3.2433 1.2065 1.1028 1.0942 1.0428 1.1085 1.9340 1.7551 5.2790 10.9444 1.0596 1.0336 1.0832 1.0757 1.1010 1.1011 1.1121 1.0769 1.0777
irintensity: 0.2984 0.6142 11.0616 2.0655 3.3186 13.1032 2.6489 9.0064 8.5077 6.8076 3.7630 3.6485 4.3613 1.2224 21.8456 2.1543 8.1306 9.0010 94.4177 23.0667 34.5211 4.2585 3.6308 43.5877 154.5065 26.4578 125.3543 170.9207 10.4944 17.7332 24.3804 69.5238 0.4355 20.2307 33.4079 105.4043 47.2255 143.5823 6.1478 43.4893 45.2049 121.1915 46.8984 9.4740 33.7443 23.4129 68.6566 1015.4863 141.7225 23.6107 375.8209 36.8974 9.6014 6.2760 17.2858 11.3332 0.4029 12.8578 88.1643 36.1469
temp: 298.150 k
press: 1.00000 atm
elementType: 17 8 8 8 7 7 7 7 6 6 6 6 6 1 1 1 1 1 1 1 1 1
symmnumber: 1
zpe: 417746.9 jmol-1
zpe.correction: 0.159111 hartree
zpe.thermalcorrener: 0.173426 hartree
zpe.thermalcorrenthalpy: 0.174370 hartree
zpe.thermalcorrgfe: 0.114567 hartree
zpe.sumelectzpe: -1099.627891 hartree
zpe.sumelectthermal: -1099.613576 hartree
zpe.sumelectthermalent: -1099.612632 hartree
zpe.sumelectthermalfe: -1099.672435 hartree
dipole: -1.0284 1.0693 0.4247
dipole: 1.5432
quadrupole: -70.7434 -103.4853 -81.2966
quadrupole: 3.9686 -4.5593 -1.8558
quadrupole: 14.4317 -18.3102 3.8785 3.9686 -4.5593 -1.8558
hfenergy: -1099.7870024 hartree
pointgroup: C01 [X(C5H9Cl1N4O3)]
dipole: 0.349734 -0.483617 0.1113923 debye
dipolederiv: -0.2574765 0.0122612 0.0290999 0.1185063 -0.5202702 -0.1450122 0.0749849 -0.0806349 -0.243287 -0.7541545 -0.0932293 -0.0238844 -0.0652828 -0.9323939 -0.0742499 -0.0057806 -0.0597913 -0.3339273 -0.6722727 0.0155586 -0.0428309 0.21147 -0.9048611 0.1670525 -0.0980052 0.1530232 -0.3641397 -0.6271702 -0.7520956 0.1026345 -0.2088449 -0.7501811 0.1018671 -0.0355721 -0.007846 -0.1846232 -1.32674 0.3624842 0.0242671 0.4953623 -0.5780237 0.0651003 -0.0281315 0.0753771 -0.5376464 -2.3269518 -0.0225103 -0.258093 -0.0640385 -0.4829136 -0.0262541 -0.3636502 -0.0050862 -0.3948749 -0.7009279 -0.2365422 -0.0307901 -0.7734875 -1.1389657 0.1151061 0.0727652 0.1828435 -0.1537123 0.0320962 0.466428 -0.0910206 0.546739 1.3089938 -0.2240102 -0.1009426 -0.2112201 -0.0170945 0.6726632 -0.1097951 0.0427615 0.2702578 -0.1381885 -0.082014 0.1025797 -0.0737657 0.2284466 0.1277173 -0.0368553 -0.0240103 -0.1554669 0.7348438 0.1450654 -0.0592121 0.1756166 0.1833079 2.5270648 -0.1879979 0.2131627 -0.0257393 1.4368807 0.1243587 0.2115106 0.0327398 0.3343911 2.3413396 0.4096877 0.2007838 -0.1834798 1.3876982 -0.2770071 0.3364053 -0.1843547 0.4343754 0.1859536 0.0203854 -0.0077985 -0.1206472 0.0349319 0.0198352 0.0294386 0.042532 0.1961134 0.1365327 0.0559887 0.0418732 -0.1133449 0.0377254 -0.0219767 0.0383282 -0.0427797 0.1051526 -0.0908996 0.0439856 -0.0423171 0.0248269 0.0934988 0.119521 -0.0768176 0.0650074 -0.0566455 0.1884861 -0.0146462 -0.0595784 -0.1122887 0.1455072 -0.0314678 -0.0918673 -0.0359531 0.3416302 0.1040287 0.036175 -0.0581847 0.0335092 -0.0589714 0.034141 -0.0183755 0.0143172 -0.0407201 -0.1255362 -0.0233271 -0.0142356 -0.0118178 -0.0259876 -0.0312353 -0.0108324 -0.0547506 0.0941164 0.3427143 0.0538033 -0.022209 0.1655144 0.1985657 0.0383757 -0.0014232 0.0256249 0.3015616 0.1832376 -0.0416881 0.0129575 0.0368974 0.0213643 0.0325866 -0.0026487 0.0198352 0.1394963 0.0018873 0.0234203 0.0411499 -0.0328632 0.0893402 0.0540776 0.0825188 0.0121252 -0.0206445 0.038408 0.0185091 -0.0337376 -0.0357819 0.0414068 -0.1038599 -0.0552723 -0.0428599 -0.011276 unknown
polarizability: 137.9509467|1.5277911|123.3805252|5.6326708|-1.6981668|61.2785233 unknown
InChI: InChI=1S/C5H9ClN4O3/c1-10(9-13)5(12)8-4(11)7-3-2-6/h7-8H,2-3H2,1H3
charge 0 multiplicity 1
22 atoms
Cl 4.258082 -2.092319 -0.732265
O  1.204436 1.961055 0.490584
O  -1.604742 2.042313 -0.409604
O  -3.466736 -2.119438 0.194887
N  1.958818 -0.253184 0.540473
N  -0.318388 0.148471 0.241482
N  -2.641817 -0.048477 -0.110388
N  -2.421034 -1.386406 0.21573
C  3.359182 0.108588 0.774017
C  4.262079 -0.216512 -0.416373
C  0.978215 0.727931 0.421868
C  -1.473593 0.839796 -0.108707
C  -3.978306 0.461375 -0.456067
H  3.383054 1.200558 0.949756
H  3.738311 -0.397467 1.681142
H  1.759998 -1.235177 0.335246
H  3.907044 0.236588 -1.352822
H  5.313067 0.040431 -0.219068
H  -0.468039 -0.854049 0.426047
H  -3.878232 1.533969 -0.672926
H  -4.671617 0.298595 0.386787
H  -4.371084 -0.078145 -1.334903
