program: Gaussian 09
title: 000257672
version: EM64L-G09RevD.01
frameworkgroup: C1[X(C9H16ClNO)]
method: RPBEPBE
basis: SDD
operation: Freq
keyword: #p
keyword: freq=noraman
keyword: PBEPBE/SDD
title: #p freq=noraman PBEPBE/SDD
converged: YES YES NO NO
title: Mulliken charges:
elementType: Cl O N C C C C C C C C C H H H H H H H H H H H H H H H H
charge: -0.083232 -0.276718 -0.365094 -0.167561 -0.433145 -0.429975 -0.392243 -0.390875 -0.387283 0.211712 -0.326796 -0.556622 0.193732 0.230588 0.202130 0.200555 0.227295 0.202186 0.188956 0.189366 0.202564 0.199614 0.195936 0.308175 0.265508 0.244336 0.267355 0.279537
chargesum: 0.00000
title: Mulliken charges with hydrogens summed into heavy atoms:
elementType: Cl O N C C C C C C C C C
charge: -0.083232 -0.276718 -0.056919 0.026171 -0.000427 -0.002125 -0.001101 0.001056 0.008266 0.211712 0.183047 -0.009730
polarizability: 1.37154216e+02 1.68105481e+00 1.05797046e+02 3.07424833e+00 6.36644945e+00 9.54652927e+01
1716.lowfreq: -23.7881 -10.5372 -0.0004 0.0015 0.0016 5.3542 16.9300 41.7511 48.0254
frequency: 4.7247 41.0337 47.8009 86.0119 105.2259 188.1587 209.7541 214.8382 253.9008 281.9635 325.6435 359.4925 427.2451 448.6002 482.9100 500.7214 589.5592 609.7120 705.7632 710.0114 782.3059 788.1037 819.3929 848.3808 877.8871 892.9814 921.4698 927.2786 979.7508 1001.6232 1036.9847 1046.2790 1050.8041 1069.9590 1097.9219 1111.3386 1143.0324 1162.7588 1178.0169 1194.1367 1230.3032 1246.6103 1251.7128 1265.2514 1294.6495 1296.3062 1314.6628 1318.4942 1332.3694 1341.9063 1344.4216 1356.6270 1364.4000 1441.5102 1444.3556 1459.1683 1460.5152 1462.4118 1469.4489 1476.0131 1479.8370 1610.8214 2951.1171 2962.2337 2962.9135 2970.0134 2979.7209 2984.2547 2991.4430 3025.2953 3028.7106 3035.3512 3043.2975 3049.2115 3052.4923 3065.2365 3153.1459 3549.2621
redmass: 3.6533 5.4142 7.1703 3.1485 3.5295 4.1991 1.9088 3.3280 3.3828 5.0925 1.9254 2.1955 2.9839 3.0203 2.2192 1.8126 2.8427 1.3843 3.6812 5.9595 1.4651 2.4623 2.1420 2.0775 1.7422 1.4921 1.9820 2.5302 2.3200 2.1624 1.9105 1.3031 1.7294 1.3886 2.6446 2.3411 2.3088 1.3672 1.4304 1.5600 1.2624 1.4284 1.3145 1.2908 1.1813 1.2037 1.3847 1.3775 1.3779 1.4918 1.5039 1.4703 1.4341 1.1066 1.1156 1.0860 1.0865 1.0869 1.0840 1.1059 1.8378 6.1916 1.0829 1.0629 1.0635 1.0623 1.0607 1.0616 1.0588 1.0978 1.0939 1.1033 1.1034 1.0982 1.1026 1.0612 1.1120 1.0775
irintensity: 0.0393 7.1447 2.9775 1.3588 6.6174 8.1778 0.1783 0.8028 5.0997 3.3205 4.8489 14.1764 0.1163 3.2133 4.0687 0.5769 31.8634 108.2344 4.6116 3.3463 0.0084 1.0802 18.4424 2.7786 0.7085 11.0028 0.8531 8.8159 31.2351 7.2466 3.4774 0.1779 2.1900 0.4921 5.0615 0.0425 2.3956 16.3788 2.3410 23.7790 78.1721 35.5630 0.6528 0.5705 15.8477 6.0174 32.0957 3.0561 0.2322 0.5109 5.8327 5.1042 8.8815 7.7541 42.6710 1.8777 9.3757 12.0161 21.9266 15.2072 225.5271 131.3465 21.3819 24.8764 52.1713 31.6643 36.8507 16.5632 49.0204 80.4487 58.4147 25.0232 10.4170 6.9517 99.1896 23.0997 14.9302 24.0488
temp: 298.150 k
press: 1.00000 atm
elementType: 17 8 7 6 6 6 6 6 6 6 6 6 1 1 1 1 1 1 1 1 1 1 1 1 1 1 1 1
symmnumber: 1
zpe: 631562.3 jmol-1
zpe.correction: 0.240549 hartree
zpe.thermalcorrener: 0.253405 hartree
zpe.thermalcorrenthalpy: 0.254349 hartree
zpe.thermalcorrgfe: 0.197580 hartree
zpe.sumelectzpe: -941.655558 hartree
zpe.sumelectthermal: -941.642703 hartree
zpe.sumelectthermalent: -941.641759 hartree
zpe.sumelectthermalfe: -941.698527 hartree
dipole: -0.0376 -0.9999 -0.9596
dipole: 1.3864
quadrupole: -78.2612 -86.7172 -80.2365
quadrupole: -8.3402 -3.8763 -3.2326
quadrupole: 3.4771 -4.9789 1.5018 -8.3402 -3.8763 -3.2326
hfenergy: -941.8961078 hartree
pointgroup: C01 [X(C9H16Cl1N1O1)]
dipole: -0.0540706 0.2460541 -0.483792 debye
polarizability: 135.7151915|0.6737513|100.742291|-7.6273964|-8.4556563|101.9590727 unknown
InChI: InChI=1S/C9H16ClNO/c10-6-7-11-9(12)8-4-2-1-3-5-8/h8,11H,1-7H2
charge 0 multiplicity 1
28 atoms
Cl 4.214423 1.247206 -1.507679
O  0.595728 -1.328324 1.32255
N  1.625284 -0.436757 -0.562965
C  -0.797817 -0.036914 -0.240731
C  -1.899816 -1.125634 -0.363243
C  -1.24147 1.075988 0.754334
C  -3.261736 -0.51094 -0.76262
C  -2.602471 1.688437 0.349575
C  -3.694198 0.599948 0.223958
C  0.515453 -0.660052 0.244334
C  2.960958 -0.918109 -0.203026
C  3.948697 0.214668 0.070859
H  -0.645719 0.426376 -1.239767
H  -1.984448 -1.637725 0.614548
H  -1.592125 -1.890753 -1.102605
H  -0.466084 1.865328 0.80858
H  -1.315829 0.622783 1.762092
H  -4.030296 -1.306867 -0.804423
H  -3.189792 -0.082813 -1.784531
H  -2.497371 2.215333 -0.621921
H  -2.904107 2.450089 1.094488
H  -4.649808 1.052146 -0.105233
H  -3.876263 0.150374 1.221652
H  1.532089 0.132814 -1.406356
H  2.835009 -1.513705 0.722451
H  3.361496 -1.583242 -0.991119
H  4.9481 -0.16089 0.335956
H  3.575913 0.927035 0.820644
