program: Gaussian 09
title: 000257671
version: EM64L-G09RevD.01
frameworkgroup: C1[X(C12H11ClN4O2)]
method: RPBEPBE
basis: SDD
operation: Freq
keyword: #p
keyword: freq=noraman
keyword: PBEPBE/SDD
title: #p freq=noraman PBEPBE/SDD
converged: YES YES NO NO
title: Mulliken charges:
elementType: Cl O O N N N N C C C C C C C C C C C C H H H H H H H H H H H
charge: -0.043745 -0.258889 -0.231635 -0.459775 -0.189318 -0.078198 0.055349 0.377425 -0.190003 0.478509 -0.353775 -0.436693 -0.330700 -0.218162 -0.320182 0.287816 -0.175484 -0.571285 -0.376453 0.303544 0.405510 0.239059 0.274655 0.270362 0.232526 0.249525 0.278812 0.294438 0.234636 0.252133
chargesum: 0.00000
title: Mulliken charges with hydrogens summed into heavy atoms:
elementType: Cl O O N N N N C C C C C C C C C C C C
charge: -0.043745 -0.258889 -0.231635 -0.054265 -0.189318 -0.078198 0.055349 0.377425 -0.190003 0.478509 -0.050230 -0.197635 0.214317 0.014364 -0.070658 0.287816 0.059151 0.001965 -0.124320
polarizability: 2.81041982e+02 -5.68635076e+00 2.12473321e+02 -1.26785589e+01 4.46118522e+00 7.76771173e+01
1716.lowfreq: -3.1122 -0.0018 -0.0007 -0.0003 2.9204 5.8472 24.0456 31.8051 47.0745
frequency: 23.9300 31.5122 47.0608 66.1767 82.7134 84.6783 128.7225 168.0251 182.7962 183.5464 209.0505 235.1550 259.4185 293.0303 340.2308 379.1166 423.1113 429.1304 452.7063 469.5363 477.3153 524.4375 529.9002 581.1700 610.0803 648.4144 689.3815 700.2805 706.7727 756.3492 771.1841 797.2030 804.1595 804.9727 850.1782 852.5765 874.2507 921.4158 925.7485 945.2402 950.6125 988.1752 995.3767 1021.1317 1035.6733 1048.5905 1055.1243 1070.4003 1114.9142 1145.1738 1190.8586 1205.4327 1225.0864 1236.4996 1255.4346 1269.6091 1285.8261 1325.2321 1353.9370 1359.5693 1374.9378 1379.2771 1412.9000 1431.6262 1436.9194 1453.6647 1456.5984 1482.9149 1522.5079 1571.9243 1591.2138 1621.6706 1642.0378 3046.2022 3070.5824 3120.9318 3132.8740 3133.6938 3139.4080 3157.3150 3160.2135 3172.3603 3193.2477 3312.8091
redmass: 9.3312 7.3995 8.0722 2.6577 7.2261 6.7825 7.8934 5.0013 5.3398 6.3724 7.8151 6.8330 7.9450 5.1614 3.0479 7.4298 5.4201 4.0479 9.3548 3.2286 9.4326 7.4151 7.1873 3.8482 7.7246 3.3011 7.3870 4.6348 8.5579 1.6771 1.3004 4.5441 4.3211 2.0087 2.2427 4.1089 5.5979 1.3321 3.1255 1.2748 1.2581 1.3496 1.3687 4.4766 2.7360 1.7087 3.3820 2.1204 2.0799 1.3309 1.2166 1.8312 1.9356 2.1010 2.1695 1.1780 2.4805 1.2293 2.7279 1.5190 4.7243 2.1946 2.2046 3.3903 1.2834 2.6814 1.0962 3.2286 2.8341 6.6237 5.9906 6.3755 10.7053 1.0592 1.0559 1.1046 1.0876 1.0878 1.0922 1.0961 1.1129 1.0991 1.0948 1.0766
irintensity: 0.3563 0.0297 0.1235 0.6978 0.3138 1.5731 10.5756 1.0036 2.9097 12.0580 15.7662 0.2646 1.7821 3.8382 6.7595 27.3180 0.7480 3.5391 15.1394 0.1696 1.5886 2.0108 0.7280 0.5880 28.7801 0.0457 41.5036 6.4325 46.2205 29.7759 14.1685 46.5929 59.1322 53.8999 73.1673 27.1858 4.7926 0.1069 150.8599 35.8691 41.5351 1.8496 4.7620 34.3030 41.6867 8.0511 14.1140 8.8564 23.4836 10.8787 9.4517 0.5177 0.9741 6.3629 34.4746 5.0943 4.7710 30.1664 30.5746 48.4037 170.8580 19.5922 8.4378 78.9411 48.4540 32.6015 9.7293 231.7103 639.0137 77.1334 20.5140 5.2929 335.4096 2.3391 13.0020 1.2266 0.5633 5.6912 14.5422 26.4185 2.6199 27.1719 1.8341 100.9917
temp: 298.150 k
press: 1.00000 atm
elementType: 17 8 8 7 7 7 7 6 6 6 6 6 6 6 6 6 6 6 6 1 1 1 1 1 1 1 1 1 1 1
symmnumber: 1
zpe: 576666.8 jmol-1
zpe.correction: 0.219641 hartree
zpe.thermalcorrener: 0.236336 hartree
zpe.thermalcorrenthalpy: 0.237280 hartree
zpe.thermalcorrgfe: 0.172715 hartree
zpe.sumelectzpe: -1292.006633 hartree
zpe.sumelectthermal: -1291.989938 hartree
zpe.sumelectthermalent: -1291.988994 hartree
zpe.sumelectthermalfe: -1292.053559 hartree
dipole: -5.9199 -0.5288 0.4579
dipole: 5.9611
quadrupole: -107.3800 -118.9889 -117.5429
quadrupole: -0.9512 -2.2388 0.3861
quadrupole: 7.2573 -4.3516 -2.9056 -0.9512 -2.2388 0.3861
hfenergy: -1292.226274 hartree
pointgroup: C01 [X(C12H11Cl1N4O2)]
dipole: 2.3346546 -0.1729549 -0.1404169 debye
polarizability: 281.2507774|6.8540392|212.7372604|-8.8910804|-2.9572664|77.2043825 unknown
InChI: InChI=1S/C12H11ClN4O2/c13-6-8-17(16-19)12(18)15-10-5-1-3-9-4-2-7-14-11(9)10/h1-5,7,15H,6,8H2
charge 0 multiplicity 1
30 atoms
Cl -6.465359 -0.730589 -0.566682
O  -1.888437 -1.754448 0.327395
O  -3.166747 2.663193 0.220674
N  -0.298152 -0.016088 0.160377
N  -2.608225 0.476747 0.319516
N  1.888729 1.467702 -0.039648
N  -2.209874 1.822011 0.201332
C  0.911265 -0.736779 0.086715
C  2.087363 0.096685 -0.021617
C  3.391729 -0.511934 -0.104026
C  1.044014 -2.133334 0.111265
C  3.499984 -1.939621 -0.077644
C  -4.020442 0.068251 0.491073
C  2.344644 -2.718998 0.027897
C  4.513888 0.374116 -0.208299
C  -1.563029 -0.535511 0.270489
C  4.306977 1.755976 -0.22548
C  -4.66742 -0.253262 -0.866075
C  2.970589 2.261926 -0.138512
H  0.1543 -2.760338 0.194868
H  -0.168567 1.012454 0.122468
H  4.489098 -2.407044 -0.140402
H  -4.040293 -0.822132 1.137539
H  -4.547387 0.907594 0.975456
H  2.42562 -3.811101 0.048756
H  5.524778 -0.044428 -0.273332
H  -4.693934 0.617691 -1.536408
H  -4.199218 -1.122875 -1.347861
H  5.144139 2.455893 -0.303757
H  2.783866 3.34154 -0.150176
