program: Gaussian 09
title: 000257670
version: EM64L-G09RevD.01
frameworkgroup: C1[X(C8H15ClN2O)]
method: RPBEPBE
basis: SDD
operation: Freq
keyword: #p
keyword: freq=noraman
keyword: PBEPBE/SDD
title: #p freq=noraman PBEPBE/SDD
converged: NO YES NO NO
title: Mulliken charges:
elementType: Cl O N N C C C C C C C C H H H H H H H H H H H H H H H
charge: -0.100091 -0.312817 -0.445374 -0.417775 -0.021347 -0.408363 -0.459643 -0.387309 -0.410479 -0.375788 0.314412 -0.605691 0.295050 0.332227 0.233201 0.216298 0.205657 0.236190 0.215703 0.175305 0.202895 0.223204 0.285498 0.286573 0.221929 0.280418 0.220119
chargesum: 0.00000
title: Mulliken charges with hydrogens summed into heavy atoms:
elementType: Cl O N N C C C C C C C C
charge: -0.100091 -0.312817 -0.159876 -0.131202 0.273703 -0.076137 -0.010144 0.054538 -0.019472 0.050311 0.314412 0.116775
polarizability: 1.38342237e+02 5.78402451e+00 1.07156981e+02 6.49940169e+00 3.12947372e+00 8.69945085e+01
1716.lowfreq: -15.0422 -4.7243 0.0017 0.0020 0.0020 20.5158 43.7676 57.1024 71.2832
frequency: 43.3722 56.9592 71.1791 115.8124 132.3797 139.4749 186.5459 210.7978 237.3921 263.6262 307.9428 327.1101 353.8221 371.2473 455.3146 484.3897 509.6396 516.5786 629.6905 667.5826 698.3666 715.1698 797.4952 804.6210 861.2642 865.5039 887.0929 939.4729 991.6729 1008.6455 1052.5915 1059.1012 1085.2685 1117.3501 1127.5406 1130.6508 1138.4556 1155.2131 1183.9869 1212.0469 1224.0291 1250.6407 1274.3203 1296.6928 1322.0768 1333.1811 1335.5800 1349.5490 1355.1178 1363.4147 1421.3686 1442.3799 1443.8928 1456.3444 1467.2198 1469.2657 1479.8382 1488.1130 1523.6164 1630.4304 2944.7857 2969.2178 2970.5018 2989.7218 2998.2751 3030.4219 3041.6996 3046.0784 3049.0003 3057.4582 3064.1835 3099.0793 3105.7026 3545.4732 3561.2889
redmass: 3.6707 4.1641 5.7238 1.1233 3.3709 3.2904 3.3026 4.8154 2.4612 4.3579 1.3211 2.8693 2.0298 3.0950 2.2312 3.7286 3.1153 1.3524 2.9642 2.9164 3.8473 8.4100 3.1684 1.7239 2.4534 2.4698 1.6981 2.7701 2.6938 2.4698 1.6158 1.8630 1.7717 1.2302 1.2817 1.4852 1.8257 1.9541 2.4670 1.1954 1.6051 1.2515 1.2508 1.8198 1.5170 1.3155 1.4826 1.4133 1.4462 1.3939 1.1656 1.0951 1.4745 1.1056 1.2810 1.0919 1.1474 1.0517 1.6239 5.1411 1.0680 1.0660 1.0356 1.0614 1.0629 1.0911 1.0863 1.1027 1.0995 1.0978 1.1005 1.0887 1.0971 1.0775 1.0771
irintensity: 5.4705 8.1113 0.8425 1.1057 3.1695 3.7532 3.2132 3.4983 1.2932 1.0750 5.7881 22.2043 8.3009 2.9786 2.5602 6.7583 43.1271 196.9572 6.6381 25.8465 0.0340 13.4574 1.9914 11.3196 8.6644 5.5147 7.9914 22.8728 2.5187 14.5695 2.4249 1.5074 3.1451 3.5512 3.4504 31.9312 2.0999 5.9848 11.1596 10.3712 166.1746 8.7466 1.1568 42.5250 11.0043 11.3703 0.2120 0.8113 4.0663 5.0837 31.8246 12.2936 50.6184 26.5163 213.5752 54.9386 48.3317 21.5776 314.7177 159.8959 46.1277 32.6613 96.7188 25.8604 33.0181 61.7815 16.1355 47.2465 33.4315 18.4208 39.2552 3.1394 1.6760 11.7462 13.4531
temp: 298.150 k
press: 1.00000 atm
elementType: 17 8 7 7 6 6 6 6 6 6 6 6 1 1 1 1 1 1 1 1 1 1 1 1 1 1 1
symmnumber: 1
zpe: 600001.0 jmol-1
zpe.correction: 0.228528 hartree
zpe.thermalcorrener: 0.241718 hartree
zpe.thermalcorrenthalpy: 0.242662 hartree
zpe.thermalcorrgfe: 0.188123 hartree
zpe.sumelectzpe: -957.707529 hartree
zpe.sumelectthermal: -957.694339 hartree
zpe.sumelectthermalent: -957.693395 hartree
zpe.sumelectthermalfe: -957.747934 hartree
dipole: 1.7287 5.9728 0.9584
dipole: 6.2913
quadrupole: -74.6830 -82.9038 -78.8504
quadrupole: 4.0281 1.7908 -1.4035
quadrupole: 4.1294 -4.0914 -0.0380 4.0281 1.7908 -1.4035
hfenergy: -957.9360574 hartree
pointgroup: C01 [X(C8H15Cl1N2O1)]
dipole: 0.3876824 -2.4071637 -0.4265149 debye
polarizability: 135.953204|-8.9020546|108.7771823|-8.4337469|4.5451541|87.7633399 unknown
InChI: InChI=1S/C8H15ClN2O/c1-10-8(12)11-7-5-3-2-4-6(7)9/h6-7,10-11H,2-5H2,1H3
charge 0 multiplicity 1
27 atoms
Cl -2.320419 2.235991 0.285701
O  2.081756 1.300379 0.15595
N  0.708895 -0.584867 0.294104
N  2.973924 -0.818572 -0.3127
C  -0.463308 0.181568 0.765707
C  -1.074055 0.959812 -0.432501
C  -1.496684 -0.772839 1.408929
C  -1.80183 0.062375 -1.440898
C  -2.185069 -1.698883 0.37373
C  -2.830077 -0.878629 -0.770227
C  1.935099 0.041316 0.052127
C  4.312168 -0.303929 -0.615834
H  -0.10789 0.922162 1.504059
H  -0.308749 1.601561 -0.893642
H  -2.267227 -0.150047 1.898729
H  -1.000632 -1.363595 2.202801
H  -1.023464 -0.541463 -1.953991
H  -2.284494 0.685599 -2.214649
H  -2.95337 -2.310489 0.883575
H  -1.456483 -2.420976 -0.055707
H  -3.266498 -1.555055 -1.52939
H  -3.658924 -0.269204 -0.361662
H  0.599052 -1.589891 0.153711
H  2.824478 -1.82769 -0.316951
H  5.065179 -0.666223 0.109777
H  4.260854 0.794711 -0.547561
H  4.632967 -0.584424 -1.63679
