program: Gaussian 09
title: 000257669
version: EM64L-G09RevD.01
frameworkgroup: C1[X(C12H12N6)]
method: RPBEPBE
basis: SDD
operation: Freq
keyword: #pfreq=noraman
keyword: PBEPBE/SDD
title: #p freq=noraman PBEPBE/SDD
converged: YES YES NO NO
title: Mulliken charges:
elementType: N N N N N N C C C C C C C C C C C C H H H H H H H H H H H H
charge: -0.159206 -0.092110 -0.436289 -0.654391 -0.168671 -0.022057 -0.610318 0.240601 0.496973 -0.013035 -0.207167 0.186044 -0.411322 -0.364561 -0.225380 -0.222392 -0.234825 -0.326052 0.294321 0.234327 0.260589 0.226264 0.263957 0.363228 0.227132 0.228036 0.321855 0.306489 0.230555 0.267403
chargesum: 0.00000
title: Mulliken charges with hydrogens summed into heavy atoms:
elementType: N N N N N N C C C C C C C C C C C C
charge: -0.159206 -0.092110 -0.073061 -0.026047 -0.168671 -0.022057 -0.081670 0.240601 0.496973 -0.013035 0.053422 0.186044 -0.185058 -0.100604 0.001752 0.005645 -0.004270 -0.058648
polarizability: 1.98822215e+02 1.81235423e+01 1.87734136e+02 7.47711596e+00 4.97236099e+00 1.10459772e+02
1716.lowfreq: -0.0008 -0.0006 -0.0004 0.2697 2.9762 8.0247 17.4327 33.5667 45.1740
frequency: 15.6878 33.4777 45.1688 61.8414 101.8413 120.5888 153.3845 186.4313 230.8425 241.0959 305.1744 332.6021 344.2819 362.1241 403.8394 415.1632 465.0731 523.7347 571.5677 610.2482 618.7367 640.6181 663.9645 677.5961 707.8755 719.7556 729.9183 752.7408 783.7280 792.1396 797.2419 819.2856 852.5492 857.9266 925.2545 928.9102 945.9704 960.2902 981.5781 990.1695 1000.3831 1002.3187 1027.0216 1049.2037 1064.1885 1087.0182 1117.0386 1173.4631 1181.3630 1184.2548 1187.8882 1191.5167 1215.5124 1227.1130 1258.3856 1305.5480 1316.5638 1324.7588 1343.7109 1350.3183 1382.3858 1394.1184 1416.2631 1439.2552 1445.3891 1477.7460 1488.7897 1521.8042 1595.9104 1614.4293 1622.5686 1642.0644 3017.0367 3082.3250 3110.3583 3126.6623 3137.7726 3148.8992 3164.4993 3239.7037 3254.5010 3450.8825 3528.1106 3577.2029
redmass: 4.4181 4.7783 5.2754 3.2952 5.4883 5.1888 3.7919 3.0387 4.5211 1.9805 4.3365 4.2000 5.9082 2.7044 2.8150 4.8934 3.7063 3.7559 4.8001 4.0447 5.8129 4.8720 3.7163 4.4499 1.6888 3.4288 2.8835 2.2559 1.5888 2.1158 1.4338 3.2345 1.3217 1.2460 7.9469 1.5051 3.1724 2.4760 1.3980 5.8454 1.3442 3.9589 2.2396 3.4022 3.6144 1.6217 2.3563 1.0673 2.1510 1.5681 1.4967 1.3042 2.8454 3.2410 3.2871 2.4584 4.2339 1.8490 1.8302 2.2128 4.7866 2.4572 2.2190 2.5483 2.1160 1.5655 1.5878 8.9135 6.0787 6.0647 3.6913 1.3338 1.0603 1.1051 1.0884 1.0860 1.0913 1.0961 1.1015 1.0984 1.0987 1.0469 1.0844 1.0961
irintensity: 0.0417 0.9685 1.0398 3.2340 2.9885 10.1092 3.1054 2.0081 3.9865 3.1866 4.5689 7.7720 3.5954 2.1144 0.0498 5.3118 3.7541 16.6073 3.7019 14.6408 3.4594 5.8278 6.2640 57.7279 74.1038 49.6551 43.0126 77.3494 45.6125 19.0633 85.7545 5.7114 35.2625 0.0970 14.2266 2.4972 23.2883 15.5443 0.0708 0.0739 0.0736 13.1818 7.4610 35.4940 3.6008 8.0436 3.8977 0.1469 28.4070 3.2891 30.1127 18.6936 14.9488 22.3470 14.0521 68.8949 7.4517 5.1750 2.5967 15.0389 2.1164 9.5835 29.2203 22.6182 6.4073 24.2342 40.3718 54.9160 2.3448 2.7330 203.4963 36.4704 40.5715 8.7946 11.4638 0.2959 11.8224 25.6309 25.6098 1.5236 3.3230 15.7448 80.3269 25.0943
temp: 298.150 k
press: 1.00000 atm
elementType: 7 7 7 7 7 7 6 6 6 6 6 6 6 6 6 6 6 6 1 1 1 1 1 1 1 1 1 1 1 1
symmnumber: 1
zpe: 611032.5 jmol-1
zpe.correction: 0.232730 hartree
zpe.thermalcorrener: 0.247673 hartree
zpe.thermalcorrenthalpy: 0.248617 hartree
zpe.thermalcorrgfe: 0.188050 hartree
zpe.sumelectzpe: -791.704340 hartree
zpe.sumelectthermal: -791.689397 hartree
zpe.sumelectthermalent: -791.688453 hartree
zpe.sumelectthermalfe: -791.749020 hartree
dipole: 0.7894 1.3726 0.3848
dipole: 1.6295
quadrupole: -90.2381 -110.0646 -103.3817
quadrupole: -6.8248 1.1438 3.8334
quadrupole: 10.9900 -8.8364 -2.1536 -6.8248 1.1438 3.8334
hfenergy: -791.9370695 hartree
pointgroup: C01 [X(C12H12N6)]
dipole: 0.2576305 -0.5788079 -0.0979921 debye
polarizability: 195.1276746|-19.5257053|191.4025382|-7.1816028|-2.3869019|110.4859103 unknown
InChI: InChI=1S/C12H12N6/c13-11-10(12-14-7-16-17-12)18(8-15-11)6-9-4-2-1-3-5-9/h1-5,7-8,17H,6,13H2
charge 0 multiplicity 1
30 atoms
N  -0.279267 -1.134556 -0.540638
N  -1.364876 -2.709928 0.694094
N  -2.941014 1.387212 0.437436
N  -3.383671 -1.426496 1.30902
N  -1.296375 1.818896 -1.01841
N  -3.094116 2.741649 0.132327
C  0.786411 -0.507476 -1.373951
C  -1.470352 -0.535843 -0.077974
C  2.031932 -0.143081 -0.572904
C  -2.129388 -1.544433 0.660656
C  -0.257063 -2.421014 -0.030832
C  -1.865099 0.840209 -0.245319
C  3.178854 -0.974472 -0.602208
C  2.055969 1.038923 0.21105
C  4.329341 -0.640448 0.148535
C  3.203035 1.372416 0.963976
C  4.341937 0.532968 0.936837
C  -2.074742 2.938036 -0.751385
H  0.340479 0.39238 -1.828742
H  1.040413 -1.225109 -2.174359
H  0.567817 -3.106654 -0.207889
H  3.176316 -1.883103 -1.21847
H  1.178351 1.695583 0.216064
H  -3.514466 0.920295 1.144806
H  5.211383 -1.289832 0.116668
H  3.21269 2.288005 1.566006
H  -3.524099 -2.13825 2.032205
H  -4.197859 -1.326876 0.692546
H  5.232238 0.794052 1.519926
H  -1.901577 3.908643 -1.207975
