program: Gaussian 09
title: 000257662
version: EM64L-G09RevD.01
frameworkgroup: C1[X(C18H14O6S2)]
method: RPBEPBE
basis: SDD
operation: Freq
keyword: #p
keyword: freq=noraman
keyword: PBEPBE/SDD
title: #p freq=noraman PBEPBE/SDD
converged: YES YES NO NO
title: Mulliken charges:
elementType: S S O O O O O O C C C C C C C C C C C C C C C C C C H H H H H H H H H H H H H H
charge: 0.952260 0.952632 -0.392740 -0.393172 -0.491957 -0.484975 -0.485766 -0.491244 -0.024155 -0.024930 -0.260284 -0.230235 -0.225505 -0.177117 0.322294 0.322982 -0.324975 -0.318640 -0.324197 -0.319829 -0.185172 -0.185677 -0.185198 -0.185301 -0.225856 -0.225904 0.324299 0.292911 0.291078 0.257796 0.256474 0.258430 0.256558 0.257977 0.235984 0.236391 0.236008 0.236341 0.236191 0.236223
chargesum: 0.00000
title: Mulliken charges with hydrogens summed into heavy atoms:
elementType: S S O O O O O O C C C C C C C C C C C C C C C C C C
charge: 0.952260 0.952632 -0.392740 -0.393172 -0.491957 -0.484975 -0.485766 -0.491244 -0.024155 -0.024930 0.064014 0.062677 0.065573 0.080679 0.322294 0.322982 -0.068501 -0.060210 -0.067639 -0.061852 0.050812 0.050714 0.050811 0.051040 0.010335 0.010319
polarizability: 4.54503181e+02 -1.94766081e+00 3.49304855e+02 -8.51452848e-01 2.52306494e+01 1.95126048e+02
1716.lowfreq: -15.2685 -10.4328 -4.7382 -2.4127 -0.0027 -0.0015 -0.0010 6.5145 14.9725
frequency: -13.8590 -7.8049 14.6179 17.0110 27.0184 31.1455 33.7762 43.4327 72.5650 85.6614 88.8002 145.6844 149.3223 161.8729 163.5066 178.7560 180.4261 196.0060 216.0558 255.0834 299.7484 324.4049 324.9282 380.4263 381.8930 387.1880 393.3528 394.0312 414.1769 414.6883 424.5493 425.5789 460.3337 506.4014 510.5780 551.3275 562.8070 565.8599 604.9597 605.2625 628.6149 676.3603 678.8065 679.3364 694.5296 781.5614 781.6948 806.2400 811.1890 811.6171 822.3118 823.0906 834.1705 834.8089 920.6223 931.1896 931.6208 941.2098 942.7047 946.2594 967.4934 977.1928 977.5984 985.1113 985.3006 997.8015 997.9178 1001.5126 1013.1524 1013.3379 1042.2334 1055.3567 1073.9442 1074.0969 1092.2551 1147.0466 1147.7287 1172.6117 1172.6570 1173.0751 1194.7351 1194.9220 1267.1911 1300.6355 1301.2048 1380.5831 1380.6747 1389.4257 1409.1281 1435.0472 1436.6461 1436.8139 1454.6822 1454.7921 1568.8824 1568.9213 1571.4415 1585.3723 1585.5963 1592.3547 3134.9246 3135.0609 3145.9978 3146.0865 3154.8118 3155.4407 3159.5137 3159.5695 3164.5544 3171.3775 3171.4333 3178.3958 3178.5195 3179.4159
redmass: 6.1702 6.1547 5.8153 6.1606 4.4789 5.4739 8.8067 6.0243 8.3186 7.7410 8.8738 9.3530 9.4614 6.2348 6.2539 8.8827 7.7912 5.2105 10.7868 7.8693 11.8851 7.3237 7.3472 8.4829 6.6913 6.4196 4.1757 4.1512 3.8168 4.0316 7.7092 9.8982 5.0637 4.7526 5.0685 6.7774 4.8370 4.8749 6.5881 6.5890 7.1937 2.5255 1.8167 1.8097 8.3499 2.0134 2.0061 1.4280 4.8741 4.2847 11.8593 12.8812 1.2486 1.2490 1.3963 1.4741 1.4749 6.7594 11.1031 1.6186 6.8877 1.3819 1.3815 6.0975 6.0925 1.3419 1.3421 1.3725 2.1037 2.1069 7.2830 1.6530 1.5172 1.5199 1.5641 1.8392 1.8505 1.0623 1.0622 1.0899 1.8350 1.8253 1.2760 1.3823 1.3801 7.2442 7.2383 8.6403 2.5932 2.1468 2.3252 2.3284 2.1014 2.0995 5.8049 5.7958 6.5975 5.8644 5.8768 7.6222 1.0855 1.0855 1.0893 1.0893 1.0881 1.0932 1.0935 1.0935 1.0928 1.0965 1.0965 1.1007 1.1006 1.0999
irintensity: 0.7250 0.5576 0.0179 0.0999 0.8132 0.2079 0.0474 4.5597 5.9325 3.5169 2.9821 1.7850 1.7495 33.2987 14.5186 1.1867 0.4050 1.9360 3.9404 21.2715 0.3052 18.6699 20.0436 11.5603 22.4445 25.8747 2.4173 1.8344 2.6845 8.0295 33.8488 178.9841 101.2515 4.6377 13.5565 26.4820 8.5587 0.0778 0.0799 0.0930 2.4255 19.5836 23.5657 64.9293 4.4133 5.9422 58.5716 66.8884 20.7446 3.4891 107.0582 73.1643 0.1987 0.2667 2.7085 3.7424 7.2824 35.5211 75.6465 9.9730 11.1875 0.0309 0.0719 3.7210 2.4561 0.3662 0.2985 0.2608 5.2564 4.1233 1.8254 38.5400 9.1840 11.9238 17.4350 26.8381 26.8682 0.0348 0.0884 15.7399 0.4238 1.6959 12.5367 0.0003 0.0005 2.3369 3.1200 6.2722 36.1682 18.0213 12.3237 11.1288 7.9481 3.8128 0.9304 3.1272 22.9599 30.9124 30.7336 2.9083 0.5923 0.5116 9.4321 10.2241 8.2576 7.9618 27.1908 19.1612 11.6824 8.5996 10.4934 21.8644 20.0835 3.6922
temp: 298.150 k
press: 1.00000 atm
elementType: 16 16 8 8 8 8 8 8 6 6 6 6 6 6 6 6 6 6 6 6 6 6 6 6 6 6 1 1 1 1 1 1 1 1 1 1 1 1 1 1
symmnumber: 1
zpe: 724235.7 jmol-1
zpe.correction: 0.275847 hartree
zpe.thermalcorrener: 0.299475 hartree
zpe.thermalcorrenthalpy: 0.300419 hartree
zpe.thermalcorrgfe: 0.218288 hartree
zpe.sumelectzpe: -1939.581712 hartree
zpe.sumelectthermal: -1939.558083 hartree
zpe.sumelectthermalent: -1939.557139 hartree
zpe.sumelectthermalfe: -1939.639271 hartree
dipole: 0.1240 2.6573 -4.8329
dipole: 5.5166
quadrupole: -144.7700 -144.4770 -171.7727
quadrupole: -1.0079 -0.4532 18.4804
quadrupole: 8.9032 9.1963 -18.0995 -1.0079 -0.4532 18.4804
hfenergy: -1939.8575586 hartree
pointgroup: C01 [X(C18H14O6S2)]
dipole: 0.0861156 0.7225573 -2.0447821 debye
polarizability: 454.4277112|-2.4746347|353.3439594|3.8831288|-0.8467875|191.1624125 unknown
InChI: InChI=1S/C18H14O6S2/c19-25(20,23-15-8-3-1-4-9-15)17-12-7-13-18(14-17)26(21,22)24-16-10-5-2-6-11-16/h1-14H
charge 0 multiplicity 1
40 atoms
S  -2.86853 -1.214327 0.941306
S  2.769671 -1.180624 1.095573
O  -2.954001 0.135083 -0.566472
O  2.986251 0.073415 -0.479163
O  -4.017699 -2.349335 0.752686
O  -2.688307 -0.435207 2.355881
O  2.47875 -0.326175 2.447002
O  3.925471 -2.323833 1.061314
C  -1.211525 -1.935413 0.41171
C  1.154274 -1.92417 0.476997
C  -0.043949 -1.32626 0.896428
C  -1.224944 -3.054107 -0.437568
C  1.225513 -3.043966 -0.36813
C  0.01459 -3.614671 -0.823657
C  -4.046575 0.988049 -0.546617
C  4.081608 0.921532 -0.428202
C  -5.215857 0.649727 -1.28683
C  -3.972304 2.215924 0.172203
C  5.310059 0.521965 -1.029185
C  3.954388 2.203678 0.179873
C  -6.289387 1.559936 -1.336609
C  -5.05497 3.115103 0.115862
C  6.392794 1.422266 -1.05243
C  5.046181 3.093049 0.150322
C  -6.211977 2.790876 -0.636782
C  6.264083 2.705951 -0.46383
H  -0.064427 -0.46944 1.57846
H  -2.176705 -3.483022 -0.766819
H  2.197104 -3.466697 -0.642498
H  0.036729 -4.491135 -1.477886
H  -5.25012 -0.310398 -1.81134
H  -3.069446 2.43802 0.749698
H  5.382971 -0.477347 -1.469902
H  3.00447 2.474731 0.651238
H  -7.187888 1.313619 -1.912315
H  -5.004213 4.064775 0.658898
H  7.337692 1.127853 -1.521345
H  4.954971 4.084156 0.607232
H  -7.052539 3.492507 -0.673475
H  7.111394 3.400213 -0.479432
