program: Gaussian 09
title: 000257646
version: EM64L-G09RevD.01
frameworkgroup: C1[X(C13H13N3)]
method: RPBEPBE
basis: SDD
operation: Freq
keyword: #pfreq=noraman
keyword: PBEPBE/SDD
title: #p freq=noraman PBEPBE/SDD
converged: YES YES NO NO
title: Mulliken charges:
elementType: N N N C C C C C C C C C C C C C H H H H H H H H H H H H H
charge: -0.404323 -0.169472 -0.017873 0.443176 0.161248 -0.334388 -0.400507 -0.296947 -0.344322 0.469672 -0.806798 -0.409263 -0.365515 -0.189337 -0.191952 -0.261995 0.227553 0.230939 0.256006 0.245067 0.224583 0.230399 0.232376 0.222808 0.264016 0.226070 0.226220 0.302695 0.229867
chargesum: 0.00000
title: Mulliken charges with hydrogens summed into heavy atoms:
elementType: N N N C C C C C C C C C C C C C
charge: -0.101628 -0.169472 -0.017873 0.443176 0.161248 -0.106835 -0.169568 -0.040940 -0.099255 0.469672 -0.119441 -0.186456 -0.101499 0.036733 0.034268 -0.032129
polarizability: 3.95333265e+02 -2.42946651e+00 1.61931225e+02 3.18136278e-01 -5.67774996e-02 6.72590499e+01
1716.lowfreq: -7.8176 -6.1046 -0.0008 -0.0007 -0.0006 3.7503 25.6792 38.7247 42.1010
frequency: 25.5660 38.6854 42.0667 50.5935 96.3906 169.3983 188.6707 210.1611 239.3285 259.6860 319.6157 366.3065 405.8553 410.1152 412.6704 458.8353 507.1197 527.3859 597.7613 616.5933 620.1474 642.6040 688.9032 706.8447 723.2987 755.9868 761.4259 815.4248 834.6522 839.8710 845.9141 902.6923 914.4936 963.7943 968.3570 980.5832 982.8445 984.2067 988.9164 1004.0878 1021.6386 1045.5666 1079.1706 1116.2450 1157.2247 1166.2528 1171.2572 1181.0498 1214.6092 1222.2730 1262.4515 1301.4917 1322.2714 1355.5481 1370.8760 1389.7324 1396.9177 1417.7076 1438.1988 1469.0725 1474.0020 1477.5954 1490.3790 1507.9243 1576.6602 1596.4249 1614.3083 1616.6486 2973.4336 3049.2642 3086.3693 3118.1809 3119.6582 3128.0008 3133.2512 3145.7319 3159.5612 3164.0090 3165.7238 3182.8440 3390.3757
redmass: 3.4787 2.4270 1.3181 4.8489 4.3537 4.6795 4.2971 5.1315 5.9750 4.4116 3.0613 4.4276 2.9027 4.3518 3.0241 6.9907 2.9653 2.6441 5.8214 6.1539 6.8426 7.0425 1.6540 1.4570 2.8935 4.9997 1.7109 5.7085 1.2599 1.4955 1.2597 1.4485 4.5555 1.3454 1.3616 1.3574 5.0420 1.4971 1.3102 2.7004 2.0985 1.5542 1.6614 1.2882 3.9062 1.3387 1.0567 1.1241 2.3187 3.6298 2.0735 1.3186 1.4242 7.2409 4.8407 8.1736 1.2511 3.6749 2.2578 1.0465 1.1235 1.9816 2.5421 2.5288 6.1200 5.8167 6.1840 6.3403 1.0378 1.0969 1.0985 1.0893 1.0876 1.0888 1.0870 1.0934 1.0951 1.0948 1.0985 1.0963 1.0745
irintensity: 0.0882 1.0049 0.0386 0.4303 0.1739 5.5476 3.7412 5.2347 0.4185 0.4838 7.8871 5.4804 0.0011 9.0361 0.5470 3.1972 21.1410 14.3702 7.5073 3.5288 16.1546 19.0270 1.1700 116.3689 9.7672 1.0711 85.0714 0.0253 2.6079 54.3850 0.6982 11.0929 0.0962 3.9343 0.0015 0.1747 0.5917 12.3772 1.3858 6.8695 3.4009 13.5090 18.1616 15.8859 202.3424 7.3269 1.4834 2.1573 11.8322 9.9424 293.5750 11.9663 0.5394 148.6033 5.8073 40.9456 9.8213 1.4801 34.0767 13.0417 14.6142 1.8091 149.7663 225.7896 0.8591 6.0522 131.3742 34.4309 48.3656 21.8747 21.5972 21.1500 12.3089 29.4959 0.4219 28.4522 18.8853 1.9412 38.3154 4.1104 7.1945
temp: 298.150 k
press: 1.00000 atm
elementType: 7 7 7 6 6 6 6 6 6 6 6 6 6 6 6 6 1 1 1 1 1 1 1 1 1 1 1 1 1
symmnumber: 1
zpe: 604938.1 jmol-1
zpe.correction: 0.230409 hartree
zpe.thermalcorrener: 0.244556 hartree
zpe.thermalcorrenthalpy: 0.245500 hartree
zpe.thermalcorrgfe: 0.187126 hartree
zpe.sumelectzpe: -666.269693 hartree
zpe.sumelectthermal: -666.255546 hartree
zpe.sumelectthermalent: -666.254602 hartree
zpe.sumelectthermalfe: -666.312976 hartree
dipole: -0.1141 0.0759 0.0133
dipole: 0.1377
quadrupole: -72.9140 -82.3314 -100.9407
quadrupole: 4.3397 0.1257 -0.0055
quadrupole: 12.4814 3.0640 -15.5454 4.3397 0.1257 -0.0055
hfenergy: -666.5001015 hartree
pointgroup: C01 [X(C13H13N3)]
dipole: 0.0441362 0.0197396 -0.02442 debye
polarizability: 394.5367042|-4.1343602|126.6297459|-15.3859284|-45.6140018|103.3570895 unknown
InChI: InChI=1S/C13H13N3/c1-11-7-9-13(10-8-11)15-16-14-12-5-3-2-4-6-12/h2-10,14H,1H3
charge 0 multiplicity 1
29 atoms
N  1.594652 -0.765221 0.613641
N  -0.601956 -0.869467 0.818428
N  0.393313 -0.219286 0.259371
C  -4.590815 0.4733 0.01229
C  -1.897633 -0.359539 0.499742
C  -3.489493 1.16553 -0.567824
C  -4.312528 -0.641505 0.842416
C  -2.163232 0.764866 -0.335764
C  -2.985956 -1.055525 1.085133
C  2.818436 -0.249725 0.139922
C  -6.015541 0.91832 -0.263907
C  4.022147 -0.876108 0.561795
C  2.868883 0.866405 -0.738089
C  5.264548 -0.388187 0.107668
C  4.119443 1.340486 -1.181827
C  5.323657 0.722265 -0.766446
H  -3.685321 2.033425 -1.210455
H  -5.142048 -1.190218 1.303733
H  -1.325569 1.305922 -0.786513
H  -2.767354 -1.915572 1.726779
H  -6.74441 0.319636 0.308247
H  -6.165559 1.981681 0.001571
H  -6.26658 0.816522 -1.337575
H  3.983372 -1.738099 1.239617
H  1.93705 1.34011 -1.056221
H  6.187335 -0.877626 0.438235
H  4.154326 2.201413 -1.858959
H  1.573733 -1.5799 1.2468
H  6.289803 1.098998 -1.11771
