program: Gaussian 09
title: 000257640
version: EM64L-G09RevD.01
frameworkgroup: C1[X(C6H11NS2)]
method: RPBEPBE
basis: SDD
operation: Freq
keyword: #p
keyword: freq=noraman
keyword: PBEPBE/SDD
title: #p freq=noraman PBEPBE/SDD
converged: YES YES NO NO
title: Mulliken charges:
elementType: S S N C C C C C C H H H H H H H H H H H
charge: 0.179599 -0.001018 -0.000572 -0.600649 -0.613720 -0.433164 -0.728835 0.039269 -0.556566 0.264591 0.264878 0.202160 0.219254 0.260705 0.258630 0.260186 0.298248 0.251516 0.219941 0.215547
chargesum: 0.00000
title: Mulliken charges with hydrogens summed into heavy atoms:
elementType: S S N C C C C C C
charge: 0.179599 -0.001018 -0.000572 0.130980 0.124869 -0.433164 -0.170401 0.290785 -0.121078
polarizability: 1.58868737e+02 -3.00310763e+00 1.09491316e+02 -2.29254054e+00 1.37314547e+00 6.62812262e+01
1716.lowfreq: -10.1306 -8.5858 -0.0017 0.0017 0.0019 6.4910 27.1594 33.9735 50.4443
frequency: 26.8204 33.3268 50.3563 68.7810 96.6686 121.2518 214.0716 226.6830 238.6329 280.4991 319.5864 379.2699 412.7371 437.7353 533.1470 553.3255 571.1233 706.8831 842.1936 867.5249 936.8802 944.4126 953.1036 1010.1689 1044.6066 1091.2060 1108.6673 1119.2984 1140.2669 1216.3383 1245.8566 1255.8128 1286.8045 1370.5019 1407.5413 1422.9819 1433.2628 1441.1962 1464.4849 1464.9276 1475.7015 1501.7798 1651.2004 2977.7624 2982.1702 2989.1882 3056.3262 3071.5815 3089.0930 3094.5572 3111.1800 3122.4588 3122.7417 3199.9233
redmass: 3.6822 1.7433 2.2236 1.2578 2.4953 1.7994 3.5101 3.2750 3.4309 3.7961 3.8776 4.3730 2.4724 3.5552 9.0842 3.6340 2.6955 2.2809 4.8400 1.4880 2.0852 1.3695 4.4418 1.1477 1.6167 1.2333 1.5504 1.3484 1.6853 1.3383 1.8802 1.7459 1.2128 2.9860 1.1083 1.1282 1.1809 1.0407 1.1862 1.0757 1.0585 1.2405 4.5634 1.0351 1.0636 1.0342 1.1013 1.1013 1.0618 1.0976 1.1014 1.0952 1.0983 1.1144
irintensity: 0.0474 1.0292 3.2873 0.6640 1.6693 0.1335 1.9247 7.9018 5.1806 0.7376 3.2309 22.8357 0.1036 4.9317 0.0347 3.0010 17.8159 28.7077 22.3374 21.7108 6.4206 67.4949 134.2411 15.0263 15.4840 0.0368 8.2725 1.2681 22.1525 1.8249 31.3811 12.0254 3.3745 141.5155 13.4214 11.7461 24.0994 4.8880 11.6935 21.9828 4.5444 184.1686 9.5837 26.8214 34.8091 44.7603 15.7608 21.0253 8.8867 3.4229 4.2253 8.1430 39.2969 24.1273
temp: 298.150 k
press: 1.00000 atm
elementType: 16 16 7 6 6 6 6 6 6 1 1 1 1 1 1 1 1 1 1 1
symmnumber: 1
zpe: 417404.6 jmol-1
zpe.correction: 0.158981 hartree
zpe.thermalcorrener: 0.171154 hartree
zpe.thermalcorrenthalpy: 0.172098 hartree
zpe.thermalcorrgfe: 0.118144 hartree
zpe.sumelectzpe: -1085.367224 hartree
zpe.sumelectthermal: -1085.355051 hartree
zpe.sumelectthermalent: -1085.354107 hartree
zpe.sumelectthermalfe: -1085.408061 hartree
dipole: -2.1056 -2.7541 0.5107
dipole: 3.5042
quadrupole: -55.2502 -74.1147 -69.9688
quadrupole: 3.4217 -2.6752 1.1502
quadrupole: 11.1944 -7.6702 -3.5242 3.4217 -2.6752 1.1502
hfenergy: -1085.5262046 hartree
pointgroup: C01 [X(C6H11N1S2)]
dipole: -0.6639913 -1.1535188 0.3594092 debye
dipolederiv: -0.8484709 0.2223662 -0.0024416 0.2822735 -0.3349728 -0.1003993 0.0534034 -0.0311532 -0.116698 -0.4456943 0.0449606 0.0249224 0.1032562 -0.8890347 0.1115668 0.050593 0.0931986 -0.2335217 -1.1153334 -0.347881 0.2427126 -0.2480879 -0.762137 0.1485702 0.293196 0.1929397 -0.2664465 0.4119626 0.0044981 -0.0482364 -0.1507901 0.1518689 0.033473 -0.0344903 0.0020739 0.1995936 0.0523544 -0.0248706 0.0362143 0.1117479 0.3819196 -0.0396098 0.0217143 -0.0175808 0.207403 1.3854715 0.086548 -0.3060802 -0.2657829 1.2404347 -0.2293607 -0.3572519 -0.2595757 -0.0373117 0.4054231 0.1089377 -0.0204176 0.3765174 0.0561185 0.0381361 -0.0723551 0.0205638 0.1192354 0.0938342 -0.0606024 0.0455651 -0.0122327 -0.0923926 0.1489094 0.2223976 0.1462078 -0.0000401 -0.2187722 -0.1001233 0.0008418 -0.1307346 -0.2262472 0.2337366 -0.079625 0.2062693 -0.0276365 0.0276308 0.0039684 0.0004772 0.1126775 0.0571424 0.0468801 -0.079976 0.0507122 -0.0534025 0.042013 -0.0395809 -0.04254 0.07987 0.00708 -0.1168328 0.0018615 -0.0651818 -0.0093995 -0.0431661 -0.0746759 0.0530356 -0.1870056 -0.0212343 0.0724223 0.0747955 0.0452631 0.0944045 -0.1317347 -0.1169811 0.0779017 -0.0069652 0.082557 0.0106857 0.0719833 0.0370079 0.102221 0.0487253 0.0815822 -0.1230423 -0.017014 0.0015062 0.0236732 -0.1000866 0.0327226 -0.0064806 0.1336453 0.0742594 0.0411808 -0.0086133 -0.0284695 -0.0263432 0.0311383 -0.0892557 -0.0584121 -0.0474576 0.0196299 0.1054138 -0.0078013 0.0530303 -0.0982015 0.0228643 -0.0577558 0.0105722 0.1198288 -0.0002683 -0.0835938 -0.1623848 0.0278216 0.0658046 -0.0635359 0.0003794 0.0680247 0.064837 0.0796871 0.0524223 0.0474625 0.0749151 -0.0960227 -0.0025985 -0.0760867 0.010156 0.0124289 -0.0145548 -0.0835079 0.0127411 0.1364167 -0.1032358 -0.1316483 -0.1063806 -0.0093275 0.0524745 0.0531007 0.0291721 0.0708663 0.0836772 -0.1238522 0.0776203 -0.1243682 0.0070663 unknown
polarizability: 158.5165701|3.2751496|109.2320463|-5.6337401|-4.1498262|66.8926626 unknown
InChI: InChI=1S/C6H11NS2/c1-4-5-9-6(8)7(2)3/h4H,1,5H2,2-3H3
charge 0 multiplicity 1
20 atoms
S  0.684447 -1.301783 -0.655823
S  -0.770596 1.497121 -0.718643
N  -1.91279 -0.881662 -0.042882
C  -3.172958 -0.133307 0.170298
C  -1.895514 -2.346643 0.175654
C  -0.796951 -0.190809 -0.444835
C  2.026012 -0.050848 -1.17388
C  2.828667 0.426959 0.001764
C  4.151667 0.17649 0.177465
H  -3.490057 0.364554 -0.763459
H  -3.027826 0.655492 0.929716
H  -3.953416 -0.835254 0.503611
H  -2.895005 -2.673025 0.499036
H  -1.161634 -2.621955 0.955726
H  -1.629734 -2.883712 -0.75383
H  2.631867 -0.585636 -1.923052
H  1.458205 0.775597 -1.643358
H  2.27719 1.032566 0.733538
H  4.698001 0.570182 1.041564
H  4.725921 -0.422826 -0.540307
