program: Gaussian 09
title: 000257630
version: EM64L-G09RevD.01
frameworkgroup: C1[X(C21H32O3)]
method: RPBEPBE
basis: SDD
operation: Freq
keyword: #pfreq=noraman
keyword: PBEPBE/SDD
title: #p freq=noraman PBEPBE/SDD
converged: YES YES NO NO
title: Mulliken charges:
elementType: O O O C C C C C C C C C C C C C C C C C C C C C H H H H H H H H H H H H H H H H H H H H H H H H H H H H H H H H
charge: -0.241587 -0.200026 -0.445388 -0.132934 -0.104728 -0.132087 0.381798 0.384686 -0.530321 -0.040815 -0.534857 -0.232136 -0.497298 -0.560050 -0.510057 -0.473804 -0.479535 -0.824184 -0.829267 -0.614130 -0.542584 0.085621 0.170818 -0.384185 0.232556 0.206216 0.187627 0.223127 0.228680 0.190239 0.200467 0.210822 0.239007 0.221237 0.209465 0.213468 0.238128 0.206894 0.210490 0.261592 0.214246 0.217694 0.216004 0.227433 0.228040 0.249306 0.227002 0.217105 0.223232 0.240907 0.241657 0.243606 0.230936 0.239931 0.224525 0.365413
chargesum: 0.00000
title: Mulliken charges with hydrogens summed into heavy atoms:
elementType: O O O C C C C C C C C C C C C C C C C C C C C C
charge: -0.241587 -0.200026 -0.079975 0.099622 0.101488 0.055540 0.381798 0.384686 -0.078514 0.149424 -0.123568 0.006870 -0.066596 -0.108455 -0.092673 0.002035 -0.045837 -0.119405 -0.161928 -0.131566 -0.068042 0.085621 0.170818 0.080270
polarizability: 2.74044669e+02 -4.83430637e-01 2.08707824e+02 -7.38779386e+00 -4.26480941e-01 1.85818789e+02
1716.lowfreq: -10.9702 -6.6559 -0.0009 -0.0006 -0.0002 9.7889 29.3265 37.5030 52.2919
frequency: 29.2344 37.4024 52.2581 59.0867 78.5088 102.2165 118.6864 131.3340 150.2064 174.3469 189.2971 192.0181 204.8600 214.5675 219.6774 233.1567 265.3427 276.1339 297.4086 301.4427 313.5184 322.5914 345.9818 361.1319 364.8732 371.5587 408.3995 421.6707 423.9886 442.9900 459.4156 494.0266 499.1757 512.1312 519.5566 531.7480 550.1014 568.4309 600.1403 611.8009 642.8597 680.1441 729.3442 743.4701 748.5690 803.5142 816.5985 823.9071 830.0273 847.7356 879.4871 892.2370 899.5740 905.8154 919.6038 929.1385 938.7925 946.2876 961.1550 963.7443 987.3001 997.9672 1003.9946 1012.7134 1019.6298 1022.6502 1035.5856 1043.5748 1052.5413 1073.1543 1080.8622 1089.0545 1100.1415 1109.0400 1114.5759 1119.9516 1126.0819 1131.8475 1147.4545 1153.0188 1163.7167 1179.5911 1186.9278 1190.4506 1201.7782 1212.9552 1220.2272 1225.2527 1233.2836 1245.0422 1249.0724 1250.0388 1252.9028 1264.6453 1270.2968 1276.2014 1290.0139 1295.9216 1306.7742 1308.4749 1324.5293 1326.2594 1330.4141 1331.9833 1335.3878 1341.0736 1347.8743 1351.3840 1357.0888 1368.5794 1370.6917 1386.8069 1389.0495 1399.2231 1430.7489 1439.8065 1444.3206 1458.7665 1468.0014 1468.8596 1470.5430 1471.2442 1474.8505 1475.4547 1478.8827 1487.8931 1491.3700 1492.4353 1603.3528 1634.2585 2902.5546 2907.9835 2939.0404 2945.4200 2952.0452 2952.6758 2963.3011 2971.2681 2971.6490 2972.5125 2973.6847 2977.2027 2978.4864 2991.4364 2992.3318 2994.1931 2996.6626 3015.3118 3016.3043 3020.4980 3029.9506 3037.0895 3046.6971 3048.4486 3055.5089 3060.3832 3065.0419 3077.9370 3078.4315 3081.8757 3097.6825 3407.3019
redmass: 6.7057 4.9929 5.7278 5.1787 3.6564 2.5037 2.7541 3.0358 1.6595 2.6923 2.0478 2.2399 2.2748 2.3661 2.6065 1.7912 2.6759 2.1102 2.7806 2.5080 3.6504 2.9939 2.7100 2.6343 3.0284 3.1257 1.7104 2.5609 2.8728 2.9722 2.0553 2.7555 2.8209 2.4511 2.5288 2.3432 2.9535 2.5632 2.9440 2.6435 2.9571 2.7981 3.4326 2.9310 2.6412 2.3526 2.1757 2.2938 1.6729 1.9446 1.6962 2.0562 2.9599 2.2587 1.7400 2.6523 1.9023 2.2452 1.9766 1.8525 2.0278 2.8256 2.2269 2.4537 1.9661 1.9407 2.7433 1.8088 2.2875 1.9893 2.7393 1.9596 1.5201 1.6542 1.7979 2.1079 2.0301 2.2444 1.9338 1.6340 2.1408 1.1734 1.5710 1.7585 2.2096 1.2844 1.6097 1.8161 1.5059 1.3933 1.4270 1.5171 1.5768 1.4327 1.4966 1.4310 1.4050 1.2898 1.3875 1.4573 1.4344 1.4357 1.3897 1.5159 1.3349 1.5063 1.4483 1.4111 1.4082 1.4445 1.3605 1.4202 1.2107 1.2046 1.0792 1.0810 1.0761 1.0706 1.0825 1.0831 1.0692 1.0799 1.0760 1.0772 1.0571 1.0593 1.0846 1.0633 7.0433 10.6385 1.0814 1.0791 1.0645 1.0797 1.0707 1.0625 1.0740 1.0668 1.0798 1.0568 1.0628 1.0482 1.0622 1.0636 1.0867 1.0488 1.0573 1.0717 1.0866 1.0972 1.1005 1.1000 1.1010 1.0959 1.1000 1.0973 1.0947 1.0982 1.0987 1.1017 1.0986 1.0640
irintensity: 3.4285 1.2468 1.8220 2.1804 1.6514 4.6122 1.4578 3.1486 0.5746 1.6856 0.5377 0.6893 0.9892 0.0494 0.6894 1.1675 0.7630 1.8523 0.2645 2.0760 6.4653 19.0340 7.7852 3.4777 0.3656 5.8387 55.6933 12.8091 2.0377 1.3643 34.2883 16.1858 2.3706 7.4253 1.2495 1.3364 2.7112 1.9802 6.8678 3.0040 0.5152 4.9747 0.5388 3.3435 1.1901 0.2822 3.4364 0.7647 1.8393 11.2983 2.1625 10.6075 29.3530 1.7790 0.6981 3.6853 2.2363 2.9968 2.0054 3.1526 3.4622 34.9494 26.8429 15.2665 10.2935 6.4248 61.2159 1.6268 14.7688 0.3566 10.9936 9.1592 5.7951 4.9533 5.4563 22.1775 11.3469 16.4717 8.0599 1.4662 3.1659 9.7431 3.4166 8.4330 20.6020 6.0097 11.6423 1.6334 29.2919 70.5331 43.9070 1.8844 15.7506 2.3348 3.3867 5.4158 16.8859 0.3376 1.3489 5.9662 1.5110 1.1937 3.2336 5.4042 14.1614 22.9760 13.8306 4.5203 6.3282 10.4280 18.8227 51.8953 13.6308 30.1408 11.7844 28.7696 12.5030 1.7219 10.6637 17.4427 9.3702 5.6821 11.7974 1.4112 0.3630 8.7642 10.1805 6.1081 84.3144 221.8234 0.3007 31.3015 33.0218 20.8335 7.5469 31.5008 30.2566 18.9113 26.5810 16.2775 12.6350 45.2166 65.0512 27.9521 10.5387 19.9220 29.3908 55.1701 28.7805 36.5139 52.0844 40.1230 36.9438 20.5601 19.5216 62.6029 16.3649 20.6867 36.1839 35.6632 24.5278 26.7744
temp: 298.150 k
press: 1.00000 atm
elementType: 8 8 8 6 6 6 6 6 6 6 6 6 6 6 6 6 6 6 6 6 6 6 6 6 1 1 1 1 1 1 1 1 1 1 1 1 1 1 1 1 1 1 1 1 1 1 1 1 1 1 1 1 1 1 1 1
symmnumber: 1
zpe: 1285203.0 jmol-1
zpe.correction: 0.489508 hartree
zpe.thermalcorrener: 0.512730 hartree
zpe.thermalcorrenthalpy: 0.513675 hartree
zpe.thermalcorrgfe: 0.438303 hartree
zpe.sumelectzpe: -1043.226132 hartree
zpe.sumelectthermal: -1043.202910 hartree
zpe.sumelectthermalent: -1043.201966 hartree
zpe.sumelectthermalfe: -1043.277338 hartree
dipole: 1.0561 1.7922 1.2322
dipole: 2.4178
quadrupole: -203.2221 -149.1016 -148.1587
quadrupole: -5.4085 20.8619 -3.9522
quadrupole: -36.3946 17.7259 18.6688 -5.4085 20.8619 -3.9522
hfenergy: -1043.7156402 hartree
pointgroup: C01 [X(C21H32O3)]
dipole: -0.4024349 -0.6947476 0.5101269 debye
polarizability: 274.061936|0.9156708|208.7215618|7.2287208|-0.2523479|185.7877843 unknown
InChI: InChI=1S/C21H32O3/c1-20-9-7-14(23)11-13(20)3-4-15-16-5-6-18(19(24)12-22)21(16,2)10-8-17(15)20/h13,15-18,22H,3-12H2,1-2H3
charge 0 multiplicity 1
56 atoms
O  5.328675 -0.094031 0.514655
O  -5.83243 0.696391 -1.912258
O  6.048364 2.294409 -0.458336
C  -0.348806 -1.078732 0.423217
C  1.017639 -1.106149 -0.294775
C  -1.016435 0.312852 0.174437
C  1.991116 0.028864 0.164924
C  -2.451199 0.461861 0.811404
C  -0.065397 1.486631 0.548924
C  -3.358923 -0.765883 0.409429
C  1.322736 1.389779 -0.139821
C  3.238009 -0.335881 -0.749728
C  -1.275994 -2.21062 -0.078041
C  1.88542 -2.386594 -0.243494
C  -2.657425 -2.134218 0.601612
C  3.307616 -1.899496 -0.685979
C  -3.103004 1.787216 0.25813
C  2.380231 -0.071603 1.663672
C  -2.40013 0.537282 2.362612
C  -3.949067 -0.59296 -1.013977
C  -4.621728 1.67892 -0.018533
C  4.522952 0.357677 -0.352268
C  -4.90068 0.604578 -1.070458
C  4.865923 1.689211 -1.027932
H  -0.19043 -1.225311 1.513145
H  0.805927 -0.90428 -1.371965
H  -1.164519 0.371233 -0.930499
H  0.081276 1.517203 1.644884
H  -0.532979 2.450252 0.271913
H  -4.225117 -0.762422 1.106301
H  1.194858 1.498275 -1.238039
H  1.955698 2.233737 0.200684
H  2.974877 -0.007453 -1.777083
H  -0.815521 -3.196708 0.123684
H  -1.383753 -2.131785 -1.180754
H  1.49935 -3.181117 -0.90567
H  1.911247 -2.800868 0.782034
H  -3.319398 -2.936291 0.219207
H  -2.529358 -2.330414 1.685322
H  4.087102 -2.206292 0.032366
H  3.590388 -2.310057 -1.671542
H  -2.606166 2.073641 -0.690381
H  -2.918662 2.616844 0.965753
H  2.993293 0.797579 1.964402
H  1.491413 -0.090773 2.316169
H  2.976333 -0.974371 1.877909
H  -1.787221 1.385759 2.714182
H  -3.41952 0.679693 2.77011
H  -1.990328 -0.384432 2.813696
H  -4.497498 -1.493708 -1.346126
H  -3.14609 -0.426844 -1.762023
H  -5.050205 2.636915 -0.362148
H  -5.16375 1.402465 0.910243
H  4.006013 2.384283 -0.936558
H  5.01491 1.491611 -2.113065
H  6.416367 1.631538 0.195032
