program: Gaussian 09
title: 000257614
version: EM64L-G09RevD.01
frameworkgroup: C1[X(C7H7N5O2S)]
method: RPBEPBE
basis: SDD
operation: Freq
keyword: #p
keyword: freq=noraman
keyword: PBEPBE/SDD
title: #p freq=noraman PBEPBE/SDD
converged: NO NO NO NO
title: Mulliken charges:
elementType: S O O N N N N N C C C C C C C H H H H H H H
charge: 0.332888 -0.233077 -0.185973 -0.185324 -0.405310 0.014110 0.002649 -0.021028 0.241052 -0.094840 0.197500 0.155710 -0.605946 -0.355874 -0.829165 0.251591 0.276512 0.251580 0.376102 0.279103 0.258625 0.279114
chargesum: 0.00000
title: Mulliken charges with hydrogens summed into heavy atoms:
elementType: S O O N N N N N C C C C C C C
charge: 0.332888 -0.233077 -0.185973 -0.185324 -0.029208 0.014110 0.002649 -0.021028 0.241052 -0.094840 0.197500 0.155710 0.173737 -0.355874 -0.012322
polarizability: 2.25728769e+02 -3.15504187e+00 1.54325409e+02 1.30106407e-03 1.93963238e-02 6.04021379e+01
1716.lowfreq: -3.1886 -0.0020 -0.0005 0.0017 3.7677 13.7300 45.6913 75.6939 99.0026
frequency: 45.6200 75.6866 99.0023 117.9844 124.9663 131.9412 141.7572 180.2264 226.4936 255.3713 295.0033 303.2639 357.9012 377.8422 385.3067 427.1347 432.8447 479.5252 599.2978 623.9434 648.8562 659.2809 669.9570 686.3968 708.9237 709.1224 775.4646 802.7973 826.9868 940.1223 980.2937 997.8927 1012.4086 1068.9540 1100.3540 1129.7996 1165.9724 1182.1693 1214.0334 1246.9598 1321.2446 1348.0929 1373.0835 1394.1811 1418.5764 1438.7882 1447.0694 1454.5702 1476.2274 1485.5759 1497.7124 1644.5074 1654.3261 3019.2053 3025.8653 3113.2661 3146.7540 3152.8341 3154.9359 3517.9106
redmass: 4.7639 6.2645 3.5624 1.0877 4.1468 1.5198 2.6581 6.5586 4.6419 6.8033 7.7357 5.9021 4.9221 10.4694 8.6798 11.5555 11.6355 9.6604 10.0152 5.2409 9.2199 7.2970 8.1908 3.7629 10.0414 7.3841 1.8373 8.1015 6.5710 3.3477 1.1814 1.4057 5.1144 8.2459 6.3945 1.3039 7.9325 3.0152 10.2708 5.7207 8.6189 1.2185 1.6670 3.3582 1.5076 1.0518 1.0575 4.8232 1.0430 1.3338 4.1783 11.9018 5.4164 1.0329 1.0281 1.1025 1.1024 1.1045 1.1056 1.0769
irintensity: 1.0840 1.8446 0.0258 0.0173 0.4427 0.2512 2.3540 7.1343 2.5828 0.0038 1.6943 0.9548 4.9941 11.1862 31.4648 13.6718 8.2981 1.2893 3.2107 6.7274 0.5489 1.1513 4.6404 8.7366 2.0515 11.3383 96.3747 33.9573 2.2828 2.0619 7.7568 16.2124 184.4125 153.9192 68.2773 0.2042 43.9048 41.4521 42.3096 190.9163 118.7527 1.5166 10.9971 3.5865 72.9689 16.2239 50.0891 420.7018 22.5909 69.4241 382.8085 284.1198 614.9041 16.4244 14.0617 13.4640 0.2208 7.7212 9.7062 87.9630
temp: 298.150 k
press: 1.00000 atm
elementType: 16 8 8 7 7 7 7 7 6 6 6 6 6 6 6 1 1 1 1 1 1 1
symmnumber: 1
zpe: 390536.4 jmol-1
zpe.correction: 0.148747 hartree
zpe.thermalcorrener: 0.162560 hartree
zpe.thermalcorrenthalpy: 0.163504 hartree
zpe.thermalcorrgfe: 0.107542 hartree
zpe.sumelectzpe: -1092.119319 hartree
zpe.sumelectthermal: -1092.105507 hartree
zpe.sumelectthermalent: -1092.104562 hartree
zpe.sumelectthermalfe: -1092.160525 hartree
dipole: -2.4806 6.4624 0.0071
dipole: 6.9221
quadrupole: -94.4992 -110.6955 -91.8924
quadrupole: -10.1454 -0.0190 0.0135
quadrupole: 4.5298 -11.6664 7.1366 -10.1454 -0.0190 0.0135
hfenergy: -1092.2680667 hartree
pointgroup: C01 [X(C7H7N5O2S1)]
dipole: -0.8649323 2.5802632 0.1043083 debye
dipolederiv: -0.7671795 0.3114907 0.0510289 0.2270762 0.0579749 -0.011848 0.049051 -0.0167219 -0.016413 -1.1005349 -0.3994188 0.036679 -0.5121009 -0.8905113 0.0206402 0.0343993 0.013818 -0.3609517 -0.7505754 0.3578063 0.0323041 0.3663328 -1.0353123 -0.0349737 0.032267 -0.034141 -0.3177103 -1.5694285 -0.4596965 0.0724947 -0.3783403 -0.7724638 0.010853 0.0744466 0.016725 -0.1977082 -0.5831145 -0.1977814 0.010012 -0.2090318 -1.329956 -0.0057663 0.0094103 -0.0064958 -0.35086 -1.456093 -0.2365535 0.0704441 -0.4089877 -0.3566194 0.0206282 0.067414 0.0107223 -0.1908013 1.075261 0.190865 -0.0713573 0.2868233 0.0856828 -0.0106539 -0.0689057 -0.0047611 -0.2091354 -1.1869676 -0.0050268 0.0613453 0.8799349 -0.3433687 -0.0553716 0.0795597 -0.0039015 -0.1518221 1.17152 0.4990899 -0.0440617 0.8337251 0.8298357 -0.0382104 -0.0374919 -0.0191248 0.2679788 -1.0188688 0.2169432 0.0711295 -0.5877626 -0.50502 0.0220287 0.0535404 -0.0247876 0.1148918 2.0509395 0.2773 -0.0982799 0.2583069 1.4371157 0.0049641 -0.099106 0.0039567 0.3155113 1.6033454 -0.1076652 -0.0814478 -0.2119488 1.5907776 0.0373315 -0.0824377 0.0307247 0.2575272 0.0455589 -0.0754398 0.0062153 -0.0721529 0.3862737 0.0089654 0.0065657 0.0088927 0.1778538 1.9137905 -0.2224799 -0.1129666 -0.4854058 0.3456104 0.0335432 -0.1188677 0.0180631 0.0964394 0.0576811 -0.1081683 -0.0032765 -0.0856226 0.1460233 0.0075833 -0.0026469 0.0087534 0.040406 0.0478413 0.0898628 -0.094465 0.0152189 0.0437626 -0.0163526 -0.0791808 0.0261304 -0.0190377 0.0468638 -0.1384065 0.0032203 -0.0163121 0.0997132 0.0003311 0.0053247 0.0075508 0.135493 0.0683279 0.0825459 0.0867619 0.0143523 0.0435236 0.0170144 0.0688652 -0.0343593 -0.0406196 0.2702236 -0.029932 0.0038033 -0.0320072 0.1441829 -0.0018325 0.0038775 -0.001749 0.3434902 0.0746788 -0.055575 -0.094711 0.0284865 -0.0215192 -0.0498145 -0.0717413 -0.0328205 -0.0071025 -0.0860471 0.0655518 0.0141582 0.058486 0.0692697 -0.0048661 0.0140935 -0.0052761 0.133884 0.0927778 -0.0553122 0.0809689 0.0309299 -0.0249756 0.0458064 0.0615629 0.0388016 -0.0213134 unknown
polarizability: 224.7592649|-5.9845275|154.6733871|-9.802788|2.2188847|61.0236642 unknown
InChI: InChI=1S/C7H7N5O2S/c1-12-4-3(5(13)9-7(12)14)10-11-6(8-4)15-2/h9H,1-2H3
charge 0 multiplicity 1
22 atoms
S  -3.96596 -0.123247 0.283934
O  3.212126 1.917455 -0.10104
O  2.289808 -2.651472 -0.130647
N  0.942972 1.291306 0.022697
N  2.666742 -0.350861 -0.110046
N  -1.316961 0.617746 0.142704
N  -0.568616 -2.110306 0.043478
N  -1.880277 -1.782662 0.126003
C  0.003393 0.269427 0.058345
C  0.38166 -1.108453 0.009238
C  2.340023 1.011448 -0.065895
C  1.809961 -1.493077 -0.081426
C  0.51229 2.707404 0.076125
C  -2.19413 -0.414029 0.172913
C  -3.992892 1.758663 0.326005
H  -0.149989 2.932661 -0.774774
H  1.419857 3.325839 0.030437
H  -0.037275 2.899598 1.011262
H  3.670666 -0.552443 -0.173239
H  -3.44018 2.119447 1.204663
H  -5.056757 2.032291 0.393327
H  -3.543762 2.158171 -0.593962
