program: Gaussian 09
title: 000257598
version: EM64L-G09RevD.01
frameworkgroup: C1[X(C15H9Cl2NO2S2)]
method: RPBEPBE
basis: SDD
operation: Freq
keyword: #p
keyword: freq=noraman
keyword: PBEPBE/SDD
title: #p freq=noraman PBEPBE/SDD
converged: YES YES NO NO
title: Mulliken charges:
elementType: Cl Cl S S O O N C C C C C C C C C C C C C C C H H H H H H H H H
charge: -0.009035 -0.034799 0.297145 0.293341 -0.303013 -0.154136 0.010127 -0.351096 0.384873 -0.481276 -0.273839 -0.335853 -0.238031 -0.208483 -0.784856 0.513445 -0.252989 -0.311055 0.318368 -0.203040 -0.198103 -0.101468 0.247753 0.256575 0.340190 0.303246 0.233044 0.233656 0.261073 0.283809 0.264427
chargesum: 0.00000
title: Mulliken charges with hydrogens summed into heavy atoms:
elementType: Cl Cl S S O O N C C C C C C C C C C C C C C C
charge: -0.009035 -0.034799 0.297145 0.293341 -0.303013 -0.154136 0.010127 -0.351096 0.384873 -0.481276 -0.026086 -0.079278 -0.004987 0.025173 -0.141420 0.513445 -0.252989 -0.049982 0.318368 0.080769 0.066324 -0.101468
polarizability: 3.34200336e+02 -3.91316616e+01 2.40278955e+02 7.48426164e+00 1.19450699e+01 1.29876384e+02
1716.lowfreq: -8.1540 -3.5524 -1.3811 -0.0010 -0.0003 0.0007 5.9568 9.0877 20.2871
frequency: 5.3026 8.8583 20.2568 39.0175 46.9789 50.2139 92.5227 130.4822 133.5180 162.2630 163.7478 185.4571 187.4639 215.7509 266.0718 283.8874 296.6583 334.0732 348.0238 370.3338 383.1497 413.6621 428.9935 442.8901 481.7859 486.7261 510.0044 528.6666 548.1166 581.1381 582.9848 616.8211 626.2551 651.0016 672.8972 677.5543 716.2737 730.7895 736.7746 765.3242 783.9526 825.0063 837.8801 863.1288 864.6532 875.4195 904.6072 920.7071 946.3259 948.0846 985.2291 1016.9451 1022.6133 1039.4307 1048.1384 1077.3798 1119.1605 1134.9963 1169.6095 1197.2335 1210.8708 1225.5883 1242.6272 1267.7251 1276.6781 1363.2780 1377.2978 1377.4952 1413.4842 1431.3188 1444.3436 1450.9679 1478.3367 1570.1316 1580.2215 1585.1805 1602.3861 1696.4217 2992.6128 3134.2368 3138.4536 3152.2389 3166.2313 3166.3784 3176.9287 3184.7093 3187.4081
redmass: 9.4842 10.4222 8.0908 14.5880 10.3747 9.9167 7.2359 8.7624 5.1292 8.0107 6.5232 5.9204 14.9312 10.4724 11.4313 6.0217 5.0617 7.2957 11.6544 10.8994 8.8285 5.9629 3.1306 3.4042 5.8235 8.8047 6.3382 5.2131 4.5015 5.7144 7.3192 9.5490 9.5539 5.2852 7.1061 7.3317 4.8504 2.6931 5.5286 1.5277 5.0238 1.7032 6.4554 1.3814 1.4055 7.2944 2.0926 9.6742 1.3838 1.3688 1.3208 2.2207 4.8418 5.3569 3.2583 2.3286 1.5346 1.3533 1.1227 3.3147 1.1953 2.7754 1.3233 1.3816 1.5354 5.3804 5.0761 4.9044 1.1076 2.8233 2.5704 2.6912 10.8530 6.3372 8.8817 7.3576 7.1647 11.6352 1.0661 1.0965 1.0858 1.0904 1.0957 1.0893 1.0999 1.0940 1.0971
irintensity: 0.3147 0.3629 0.0544 0.3296 0.9229 0.4696 0.9511 0.7189 5.6879 3.5515 0.0684 2.0458 0.7428 3.1718 1.8538 3.1162 26.8927 4.1039 2.0512 1.9988 7.5062 2.8387 7.5701 11.7715 4.2920 0.3695 1.8004 8.5332 9.9214 0.6795 1.7989 6.2544 25.7390 2.9483 7.8924 3.4308 3.6430 18.7285 70.3986 82.3322 58.6231 35.4242 7.8614 1.2517 19.2487 119.5383 13.1789 177.3398 2.8146 1.7452 0.0609 6.7737 212.7172 5.3058 540.2632 18.3005 6.5473 0.3170 0.1308 123.0557 13.9151 7.3680 7.5616 48.5717 12.5181 3.6648 5.5786 9.4415 37.1055 42.0381 15.9635 195.8910 156.6771 0.9602 12.4798 18.7441 3.1558 112.0319 89.3661 6.1039 1.5419 8.1822 15.7335 1.1672 16.4439 0.3558 1.3301
temp: 298.150 k
press: 1.00000 atm
elementType: 17 17 16 16 8 8 7 6 6 6 6 6 6 6 6 6 6 6 6 6 6 6 1 1 1 1 1 1 1 1 1
symmnumber: 1
zpe: 528729.9 jmol-1
zpe.correction: 0.201383 hartree
zpe.thermalcorrener: 0.221647 hartree
zpe.thermalcorrenthalpy: 0.222591 hartree
zpe.thermalcorrgfe: 0.145938 hartree
zpe.sumelectzpe: -2496.891471 hartree
zpe.sumelectthermal: -2496.871207 hartree
zpe.sumelectthermalent: -2496.870262 hartree
zpe.sumelectthermalfe: -2496.946915 hartree
dipole: -1.0056 -0.3110 1.2083
dipole: 1.6025
quadrupole: -136.8689 -142.4828 -158.7314
quadrupole: -14.2357 5.4772 0.6412
quadrupole: 9.1588 3.5449 -12.7037 -14.2357 5.4772 0.6412
hfenergy: -2497.0928535 hartree
pointgroup: C01 [X(C15H9Cl2N1O2S2)]
dipole: -0.4148908 0.2945271 -0.3723026 debye
polarizability: 337.28267|38.0329241|216.4241658|-6.4915441|41.7151574|150.6488392 unknown
InChI: InChI=1S/C15H9Cl2NO2S2/c16-9-5-6-12(10(17)7-9)20-14(19)8-21-15-18-11-3-1-2-4-13(11)22-15/h1-7H,8H2
charge 0 multiplicity 1
31 atoms
Cl 2.404172 -1.531871 -1.889404
Cl 7.53104 -1.492654 0.240833
S  -3.874435 1.403167 1.708333
S  -1.193224 2.536929 0.548644
O  2.322845 1.359386 -0.846057
O  1.15063 0.324484 0.915222
N  -2.55586 0.290033 -0.362722
C  -4.562304 -0.077073 0.900763
C  -3.704118 -0.505447 -0.164464
C  -2.49173 1.283976 0.48954
C  -5.748034 -0.764477 1.217826
C  -4.046923 -1.649547 -0.921096
C  -6.075658 -1.906087 0.450084
C  -5.233147 -2.342493 -0.606956
C  -0.0186 1.782843 -0.720106
C  3.52031 0.653584 -0.544279
C  3.719569 -0.671831 -0.990504
C  4.552649 1.325086 0.139741
C  1.148508 1.063526 -0.07636
C  4.93769 -1.337801 -0.755385
C  5.783473 0.679417 0.383879
C  5.952806 -0.644106 -0.067718
H  -6.400964 -0.435574 2.031729
H  -3.387288 -1.974995 -1.73069
H  -0.62866 1.047342 -1.27993
H  0.320769 2.583576 -1.390324
H  -6.992578 -2.459614 0.678296
H  -5.509406 -3.230682 -1.184789
H  4.382425 2.351996 0.4756
H  5.086526 -2.363439 -1.100971
H  6.587716 1.194443 0.915067
