program: Gaussian 09
title: 000257597
version: EM64L-G09RevD.01
frameworkgroup: C1[X(C11H12ClNO2S2)]
method: RPBEPBE
basis: SDD
operation: Freq
keyword: #p
keyword: freq=noraman
keyword: PBEPBE/SDD
title: #p freq=noraman PBEPBE/SDD
converged: YES YES NO NO
title: Mulliken charges:
elementType: Cl S S O O N C C C C C C C C C C C H H H H H H H H H H H H
charge: -0.055157 0.201365 0.020984 -0.292170 -0.196971 0.000270 0.364046 -0.768947 -0.413303 -0.603992 -0.617000 -0.377967 -0.292826 0.330652 -0.179575 -0.190902 -0.116900 0.300696 0.300262 0.267739 0.266183 0.213047 0.232482 0.267678 0.252430 0.262847 0.307231 0.260018 0.257780
chargesum: 0.00000
title: Mulliken charges with hydrogens summed into heavy atoms:
elementType: Cl S S O O N C C C C C C C C C C C
charge: -0.055157 0.201365 0.020984 -0.292170 -0.196971 0.000270 0.364046 -0.167988 -0.413303 0.142977 0.135589 -0.115121 0.014404 0.330652 0.080443 0.066878 -0.116900
polarizability: 2.95350020e+02 1.55960653e+01 1.42977949e+02 -6.10099982e+00 -3.46477402e+00 1.28059706e+02
1716.lowfreq: -6.9002 -3.9351 0.0011 0.0014 0.0021 8.0049 12.0565 19.4482 21.2922
frequency: 10.5586 18.5266 21.1442 33.3897 47.8594 56.8749 64.7558 88.7528 108.3715 143.2375 170.4019 200.5796 230.8490 247.3428 272.0022 296.3653 334.0063 337.6682 356.9428 377.8909 414.4060 420.3472 443.4224 500.3435 531.4209 541.2247 548.4717 607.3523 615.4907 692.7213 699.3724 734.6946 777.2896 821.4220 837.7320 842.1045 893.8796 901.1474 951.0580 954.0631 971.4544 995.1839 1047.4689 1064.7366 1080.3364 1087.0663 1108.1896 1123.4747 1148.2999 1154.3217 1189.1633 1210.6746 1240.9986 1275.5314 1288.2855 1370.9541 1385.3599 1397.7097 1406.7042 1428.1052 1448.6265 1463.3995 1465.6938 1474.9090 1476.2877 1507.7310 1582.2685 1599.1620 1660.1931 2836.1553 2980.6181 2990.9215 3072.6111 3078.2463 3108.1515 3118.1206 3120.5564 3163.0362 3169.4755 3182.3338 3212.9498
redmass: 6.0446 5.9260 3.6308 1.5948 6.0335 5.6059 1.1920 6.0764 2.6765 10.6438 6.6997 5.4798 4.5307 3.2697 9.4607 5.3481 5.4969 6.7910 4.6208 6.3639 3.0240 5.9664 3.5997 2.9024 6.1151 4.6148 4.2390 9.4399 7.2282 7.9513 3.8300 6.8243 7.5623 1.2929 1.4591 5.0198 2.0678 6.8100 1.3687 4.4973 1.3260 4.3327 1.6152 3.0218 2.6619 1.2310 1.3095 1.3736 1.7222 2.1179 1.5767 1.1912 3.8171 1.3989 1.2522 7.4170 2.2321 3.4558 1.1040 1.1284 1.0445 1.1561 2.3133 1.0757 1.0516 1.4611 7.1807 7.1276 10.8918 1.0715 1.0363 1.0345 1.0982 1.1009 1.1016 1.1011 1.0887 1.0888 1.0918 1.0978 1.0949
irintensity: 0.8742 2.1656 0.7653 0.3128 1.1125 1.5599 0.4540 1.5665 0.6827 0.5485 0.4896 5.3499 5.8745 8.6321 5.3949 28.6839 5.4795 5.1140 17.1782 13.0328 0.0905 8.2964 7.0083 22.0293 1.7122 1.1449 5.1132 4.0290 1.3249 12.3558 0.3022 46.0167 2.9227 11.4144 67.4373 42.3789 28.1933 81.3373 1.7066 120.4847 1.5899 78.1877 23.6140 441.3694 250.6169 4.5949 24.1109 3.5798 80.5950 119.5798 97.2525 58.3698 32.5468 121.1967 3.9551 8.0033 104.8027 7.8952 14.9401 15.6035 15.4245 4.2798 219.3274 19.1245 5.4859 190.4125 3.2329 0.0896 124.0513 323.3782 31.2441 44.7889 12.6156 19.2881 3.4376 31.8386 3.2404 2.3507 1.9448 1.8125 5.5499
temp: 298.150 k
press: 1.00000 atm
elementType: 17 16 16 8 8 7 6 6 6 6 6 6 6 6 6 6 6 1 1 1 1 1 1 1 1 1 1 1 1
symmnumber: 1
zpe: 549271.1 jmol-1
zpe.correction: 0.209206 hartree
zpe.thermalcorrener: 0.227940 hartree
zpe.thermalcorrenthalpy: 0.228884 hartree
zpe.thermalcorrgfe: 0.156288 hartree
zpe.sumelectzpe: -1886.487375 hartree
zpe.sumelectthermal: -1886.468641 hartree
zpe.sumelectthermalent: -1886.467697 hartree
zpe.sumelectthermalfe: -1886.540293 hartree
dipole: -4.4012 -1.0725 -1.9440
dipole: 4.9295
quadrupole: -100.7542 -118.3539 -122.7678
quadrupole: 16.9980 0.3071 -4.8857
quadrupole: 13.2044 -4.3953 -8.8092 16.9980 0.3071 -4.8857
hfenergy: -1886.696581 hartree
pointgroup: C01 [X(C11H12Cl1N1O2S2)]
dipole: -1.643137 0.910171 -0.4827452 debye
polarizability: 295.5691529|-13.8376079|130.4140219|8.8155594|4.3470003|140.4045007 unknown
InChI: InChI=1S/C11H12ClNO2S2/c1-13(2)11(16)17-7-10(14)15-9-5-3-8(12)4-6-9/h3-6H,7H2,1-2H3
charge 0 multiplicity 1
29 atoms
Cl 6.641053 -1.374827 -0.397039
S  -2.612754 1.772892 -0.023919
S  -3.671798 -0.378241 2.032426
O  1.162361 0.848282 0.818409
O  -0.28186 -0.292283 -0.661201
N  -5.062435 0.611448 -0.088408
C  2.403714 0.248642 0.444312
C  -1.146728 1.304523 1.025932
C  -3.906009 0.585218 0.642079
C  -6.224395 -0.176092 0.387407
C  -5.227425 1.40549 -1.327952
C  3.502692 0.747659 1.180171
C  2.576298 -0.743314 -0.550517
C  -0.096617 0.522253 0.260518
C  4.798887 0.25609 0.927098
C  3.87898 -1.23408 -0.79991
C  4.967467 -0.732267 -0.063692
H  -1.567597 0.65732 1.836016
H  -0.725425 2.215037 1.47315
H  -6.41608 0.036582 1.453033
H  -6.023045 -1.25863 0.293748
H  -7.108337 0.094233 -0.211443
H  -6.01191 0.94293 -1.947164
H  -4.289138 1.411503 -1.907577
H  -5.514599 2.450854 -1.105243
H  3.330806 1.512904 1.94231
H  1.725061 -1.123636 -1.115041
H  5.656662 0.634243 1.489798
H  4.034171 -2.001133 -1.563902
