program: Gaussian 09
title: 000257596
version: EM64L-G09RevD.01
frameworkgroup: C1[X(C12H13Cl2NO6S)]
method: RPBEPBE
basis: SDD
operation: Freq
keyword: #p
keyword: freq=noraman
keyword: PBEPBE/SDD
title: #p freq=noraman PBEPBE/SDD
converged: YES YES NO NO
title: Mulliken charges:
elementType: Cl Cl S O O O O O O N C C C C C C C C C C C C H H H H H H H H H H H H H
charge: 0.015678 0.020137 0.940014 -0.506408 -0.519251 -0.261914 -0.257778 -0.247514 -0.246942 -0.305591 -0.520321 -0.473765 0.003207 -0.216833 -0.260813 0.317265 0.297426 -0.049525 -0.172579 -0.088693 -0.505901 -0.502020 0.318243 0.276142 0.306337 0.300079 0.302722 0.301487 0.272595 0.234953 0.242684 0.255637 0.246451 0.240239 0.244551
chargesum: 0.00000
title: Mulliken charges with hydrogens summed into heavy atoms:
elementType: Cl Cl S O O O O O O N C C C C C C C C C C C C
charge: 0.015678 0.020137 0.940014 -0.506408 -0.519251 -0.261914 -0.257778 -0.247514 -0.246942 -0.305591 0.074064 0.132651 0.003207 0.085889 0.040674 0.317265 0.297426 -0.049525 0.100016 -0.088693 0.227372 0.229222
polarizability: 2.55359146e+02 8.21733124e+00 2.23081073e+02 -1.72745355e+01 1.65258369e+01 1.46695753e+02
1716.lowfreq: -8.7514 -4.9442 -3.0614 0.0014 0.0016 0.0020 5.6590 16.2170 22.0320
frequency: 4.9093 16.1503 21.9390 27.5215 36.3363 51.8543 65.1499 79.1456 89.3841 92.2069 105.1480 123.9496 142.3262 153.1056 163.6291 182.4806 185.7327 209.9177 211.1234 215.7605 239.8518 255.5441 269.9826 290.0822 304.4355 330.8900 343.7465 376.7847 393.9865 428.2193 433.0469 442.6534 479.7751 499.0623 531.2645 550.9421 560.1602 584.2744 650.8943 683.9759 695.8096 698.6657 745.0348 798.1229 832.2853 834.0984 841.5402 856.7496 884.4502 932.3386 944.5915 952.2909 967.7229 969.9351 994.4536 1022.3236 1063.3477 1111.1187 1113.6651 1114.5588 1116.1405 1134.7744 1148.7745 1149.8780 1166.0119 1173.2330 1226.2514 1240.6033 1260.7281 1326.2594 1343.1182 1362.6141 1373.5837 1416.4795 1421.8290 1422.7527 1431.7233 1452.3682 1453.2584 1462.0576 1462.8327 1463.1666 1561.5544 1582.9467 1634.9451 1643.0056 2975.5042 2982.1804 3009.2289 3009.4116 3072.9201 3084.1165 3113.3614 3114.7155 3155.0404 3156.6439 3161.4744 3168.5936 3179.6810
redmass: 6.9469 7.6302 4.6778 8.7279 5.8083 5.4785 4.0761 1.1646 1.2529 6.6814 9.4278 5.8435 4.0067 4.7442 5.9164 17.1413 9.8354 7.1600 4.7824 12.8038 5.0467 4.8915 3.6233 4.3841 7.9951 5.6292 7.2016 8.6830 7.3267 7.5714 5.2563 3.4090 6.5099 3.8693 6.0081 3.8640 5.3346 4.8317 7.3338 5.1637 5.6071 3.9413 9.0736 15.4091 1.3403 5.7795 6.3714 5.4521 1.4500 10.2401 6.8824 2.2486 1.3787 4.6807 8.4349 2.1858 2.3462 2.3007 1.2666 1.5551 3.2716 1.3144 1.4347 1.4423 4.5421 4.8190 1.3047 1.2895 1.2108 1.3782 1.4675 3.3116 10.0247 1.1063 1.1862 1.1565 2.3545 1.0494 1.0500 1.0710 1.0562 1.0505 6.8312 8.7263 8.7467 8.5305 1.0643 1.0657 1.0294 1.0292 1.0941 1.0952 1.1049 1.1049 1.1053 1.1051 1.0894 1.0931 1.0972
irintensity: 0.2581 0.0444 1.8334 0.6183 1.2769 1.2245 0.8578 0.4942 0.5134 4.3468 3.8612 0.9568 1.1686 0.4673 3.2936 0.3933 1.5151 4.5332 1.5073 7.3650 2.9835 26.4648 49.2862 6.5195 3.4320 25.4993 7.0603 14.4523 10.0749 40.7852 30.7677 29.5357 8.2906 8.1891 28.1633 2.4544 28.1883 42.2757 26.3485 21.2818 35.1853 2.0196 33.6681 88.1810 22.6656 16.5361 13.7435 15.2349 14.3147 85.8965 16.7799 18.6733 1.6249 38.0902 48.8785 8.5687 28.8881 289.1718 0.9579 102.2523 95.2274 18.1286 5.5290 22.8138 119.5470 100.6953 66.8745 2.8117 17.0972 69.0680 58.1345 41.4301 2.5691 44.3182 19.8800 26.2919 82.7212 15.4896 15.6401 13.0604 36.8599 10.2151 6.4610 9.7540 36.0283 261.4500 45.3955 32.3748 33.0968 27.1676 3.7053 6.0519 22.2075 19.9635 14.7182 12.9710 3.7980 7.3358 3.2300
temp: 298.150 k
press: 1.00000 atm
elementType: 17 17 16 8 8 8 8 8 8 7 6 6 6 6 6 6 6 6 6 6 6 6 1 1 1 1 1 1 1 1 1 1 1 1 1
symmnumber: 1
zpe: 626928.2 jmol-1
zpe.correction: 0.238784 hartree
zpe.thermalcorrener: 0.263511 hartree
zpe.thermalcorrenthalpy: 0.264455 hartree
zpe.thermalcorrgfe: 0.178064 hartree
zpe.sumelectzpe: -2287.499944 hartree
zpe.sumelectthermal: -2287.475217 hartree
zpe.sumelectthermalent: -2287.474273 hartree
zpe.sumelectthermalfe: -2287.560665 hartree
dipole: -0.8129 -0.0811 -3.4704
dipole: 3.5653
quadrupole: -144.3318 -123.9020 -164.1656
quadrupole: -6.6102 6.4660 6.0507
quadrupole: -0.1987 20.2311 -20.0324 -6.6102 6.4660 6.0507
hfenergy: -2287.7387287 hartree
pointgroup: C01 [X(C12H13Cl2N1O6S1)]
dipole: 0.4422736 0.0038168 -1.3311255 debye
polarizability: 252.5169918|7.764443|221.9666439|25.6496813|-17.3874012|150.6523367 unknown
InChI: InChI=1S/C12H13Cl2NO6S/c1-20-11(16)6-15(7-12(17)21-2)22(18,19)8-3-4-9(13)10(14)5-8/h3-5H,6-7H2,1-2H3
charge 0 multiplicity 1
35 atoms
Cl -4.8957 -1.75328 -0.293503
Cl -5.722276 0.99859 -1.874196
S  -0.04193 0.588174 1.173823
O  0.498456 2.124899 1.300834
O  -0.228037 -0.400366 2.454947
O  2.992436 2.561592 -1.060032
O  2.253883 -3.768834 0.181236
O  3.564772 1.007449 0.578114
O  2.246828 -2.413739 -1.712553
N  0.989101 -0.388535 -0.119795
C  1.705486 0.544669 -1.013106
C  1.783886 -1.460195 0.537354
C  -1.694448 0.689567 0.269768
C  -2.541161 -0.427242 0.31897
C  -2.018658 1.890748 -0.379061
C  2.83752 1.36508 -0.376996
C  2.094916 -2.55635 -0.477411
C  -3.783413 -0.333222 -0.340452
C  -3.266377 1.965661 -1.034925
C  -4.139669 0.857005 -1.019605
C  4.067001 3.455866 -0.556172
C  2.670534 -4.916569 -0.666659
H  2.133027 -0.100261 -1.808039
H  0.988103 1.229593 -1.493316
H  2.740181 -1.087555 0.958087
H  1.191329 -1.881263 1.367077
H  -2.258869 -1.332028 0.865182
H  -1.332812 2.742834 -0.349447
H  -3.567842 2.879436 -1.554206
H  4.055026 4.318346 -1.23629
H  5.039373 2.936414 -0.582785
H  3.839662 3.758154 0.479169
H  1.905131 -5.115813 -1.43467
H  2.762876 -5.758388 0.032714
H  3.632863 -4.696233 -1.157959
