program: Gaussian 09
title: 000257592
version: EM64L-G09RevD.01
frameworkgroup: C1[X(C10H9NO2S2)]
method: RPBEPBE
basis: SDD
operation: Freq
keyword: #p
keyword: freq=noraman
keyword: PBEPBE/SDD
title: #p freq=noraman PBEPBE/SDD
converged: NO YES NO NO
title: Mulliken charges:
elementType: S S O O N C C C C C C C C C C H H H H H H H H H
charge: 0.290532 0.324030 -0.260494 -0.223123 0.025679 -0.352484 0.371377 -0.513686 -0.272716 -0.335654 -0.239433 -0.210113 -0.716133 0.285438 -0.499632 0.247179 0.254877 0.231981 0.232269 0.314423 0.314396 0.246394 0.238482 0.246411
chargesum: 0.00000
title: Mulliken charges with hydrogens summed into heavy atoms:
elementType: S S O O N C C C C C C C C C C
charge: 0.290532 0.324030 -0.260494 -0.223123 0.025679 -0.352484 0.371377 -0.513686 -0.025537 -0.080776 -0.007453 0.022156 -0.087314 0.285438 0.231654
polarizability: 2.52831593e+02 -1.40203344e+01 1.62217588e+02 9.55496801e-03 1.26249017e-02 6.56504240e+01
1716.lowfreq: -4.8977 -3.8236 -0.6675 -0.0032 -0.0027 -0.0020 18.9200 29.3676 52.9746
frequency: 18.8755 29.3593 52.9744 62.5777 98.5961 104.8116 147.7733 165.0291 184.6212 190.2414 271.3233 287.6895 343.5221 383.6632 388.4142 428.9051 485.4086 510.4361 547.0898 573.0902 581.4310 610.1851 655.2612 677.4480 731.6642 732.8701 765.3476 834.2186 840.8157 862.3489 898.9811 914.5878 945.3533 965.6825 983.8941 1017.2875 1039.3937 1112.9238 1118.2291 1135.8970 1136.1147 1150.4477 1169.0359 1223.5489 1272.4865 1285.9742 1375.5111 1414.1825 1423.8981 1431.7007 1442.9623 1454.4768 1463.3068 1467.6071 1568.9141 1601.4943 1649.4896 3008.2874 3053.2035 3111.8956 3120.9762 3137.1911 3151.1456 3155.6285 3165.3234 3175.7539
redmass: 5.3990 6.1005 5.6744 3.4283 1.1897 4.7196 5.9913 3.0029 5.7706 8.6091 5.1259 6.6620 8.3693 11.4628 9.8570 3.1303 8.9898 6.3302 2.8249 9.8467 4.8982 8.8856 5.6575 7.1498 2.6044 6.8857 1.5553 6.6462 6.8497 1.3849 1.7707 11.1605 1.3842 5.5815 1.3187 2.2165 5.3648 1.2623 1.5447 1.5781 1.6890 1.4274 1.1250 2.8521 1.5820 1.7684 4.8072 1.0898 1.1788 2.8539 2.5656 1.0496 1.0656 10.1827 6.2901 7.1422 9.5535 1.0295 1.0583 1.1049 1.1046 1.0856 1.0903 1.1050 1.0955 1.1000
irintensity: 0.8066 0.3873 1.6808 2.5112 0.2783 0.8351 1.0260 15.3191 2.4854 0.5083 28.6568 0.0036 3.0041 1.3113 0.5099 7.7151 0.2406 1.6987 2.2473 6.4218 1.4221 32.9534 1.5928 6.9063 21.5460 15.4517 77.7937 7.5683 5.3377 1.1322 9.8662 180.1745 2.7794 26.6456 0.0886 6.4863 9.8999 0.0242 6.3065 174.9107 203.9259 4.9815 0.0676 7.3386 7.0525 77.7243 8.5899 49.4967 18.4653 46.0782 10.0250 15.3632 11.8901 194.2239 0.6116 4.0226 142.2771 35.5413 10.0282 24.0600 0.2923 1.7128 8.5093 13.3249 15.7313 18.3710
temp: 298.150 k
press: 1.00000 atm
elementType: 16 16 8 8 7 6 6 6 6 6 6 6 6 6 6 1 1 1 1 1 1 1 1 1
symmnumber: 1
zpe: 444465.2 jmol-1
zpe.correction: 0.169288 hartree
zpe.thermalcorrener: 0.184032 hartree
zpe.thermalcorrenthalpy: 0.184977 hartree
zpe.thermalcorrgfe: 0.124340 hartree
zpe.sumelectzpe: -1386.697689 hartree
zpe.sumelectthermal: -1386.682944 hartree
zpe.sumelectthermalent: -1386.682000 hartree
zpe.sumelectthermalfe: -1386.742637 hartree
dipole: -0.1501 2.7879 -0.0010
dipole: 2.7920
quadrupole: -74.4718 -100.8898 -104.2706
quadrupole: 10.6178 -0.0060 0.0070
quadrupole: 18.7389 -7.6791 -11.0599 10.6178 -0.0060 0.0070
hfenergy: -1386.8669768 hartree
pointgroup: C01 [X(C10H9N1O2S2)]
dipole: 0.0896931 1.0947743 -0.0022412 debye
dipolederiv: -0.5474089 0.0599517 -0.000096 0.0712888 -0.291386 0.0011069 -0.0001569 0.0011262 0.1116778 -0.6168061 -0.0373585 0.0001526 -0.0069797 0.0083354 0.0000474 0.0001256 -0.0000004 0.012773 -1.3102335 0.4479254 -0.0002835 0.7395097 -0.9412382 0.0005793 -0.0004709 0.0006553 -0.2949327 -0.8007192 -0.2144242 0.0004564 0.2154289 -0.8387398 0.0006727 -0.000097 0.0008704 -0.2934991 -0.8666407 -0.1980684 0.0006176 -0.4184896 -0.8908781 0.0021158 0.0011998 0.0020626 -0.1411439 0.0402487 0.2916223 -0.0008246 0.5025855 0.193683 -0.0008658 -0.0013873 -0.0008544 -0.0989708 0.5018183 0.2376128 -0.0006927 -0.0389236 0.0162811 0.0001587 0.0000968 0.0001543 0.0723009 1.5249349 -0.1138282 0.0001667 0.1626678 0.8023823 -0.0025979 -0.0005734 -0.0025391 -0.1296066 0.0305755 -0.1122666 0.0003029 -0.1822442 -0.0085567 -0.0002745 0.0004914 -0.0002919 -0.1185419 0.0055317 -0.0622003 0.0001651 -0.0461263 0.0492294 -0.0005339 0.0001161 -0.0005346 -0.1488731 -0.0118608 -0.0445588 0.0001179 -0.0674391 0.0085177 -0.0004751 0.0001707 -0.0004702 -0.167856 -0.1032217 0.077861 -0.0002139 0.1192569 0.0780626 -0.0006607 -0.0003282 -0.0006606 -0.1639541 -0.2301838 -0.1383012 0.0006669 -0.5581468 0.0838198 0.0000426 0.0021581 -0.0001106 0.1060631 1.6208405 -0.1748349 -0.0003723 -0.6131941 1.4350761 -0.0013415 -0.000569 -0.0015091 0.2094252 0.6994797 -0.1883116 0.0001457 -0.0799127 0.2506285 0.0000896 0.0000452 0.0001237 0.2775846 0.0517274 0.0366544 -0.0000903 0.0916666 -0.0258767 0.0005166 -0.0002456 0.0005256 0.166939 0.0519383 0.0856184 -0.0002253 0.0436685 -0.0184184 0.0005033 -0.0001174 0.000497 0.1679095 -0.1331626 -0.0063188 0.0000391 -0.0142596 0.0848247 0.0002223 0.0000578 0.0002177 0.1663207 0.0183999 -0.0949553 0.0002686 -0.1084038 -0.0668847 0.0006312 0.0003061 0.0006301 0.1631092 0.0577997 0.0156247 -0.0154148 0.1093458 0.0117841 -0.0594592 -0.0311734 -0.0346614 0.0410468 0.0576601 0.0157602 0.0152906 0.1096204 0.0123581 0.0595602 0.0303286 0.0348727 0.0403962 -0.0371379 0.0376835 -0.0258993 -0.0652941 0.068784 -0.0965455 -0.0686398 -0.0614127 -0.0509677 0.0334779 0.0412995 -0.0000254 0.0994307 -0.0909459 0.000195 -0.0000827 0.0002233 0.1241597 -0.0370572 0.0378131 0.0257481 -0.065056 0.0691575 0.0963125 0.0687455 0.0610859 -0.0513596 unknown
polarizability: 253.544596|11.4651545|161.5039552|-0.0650091|-0.2448238|65.6510538 unknown
InChI: InChI=1S/C10H9NO2S2/c1-13-9(12)6-14-10-11-7-4-2-3-5-8(7)15-10/h2-5H,6H2,1H3
charge 0 multiplicity 1
24 atoms
S  1.5447 -2.185901 0.007108
S  -1.515937 -1.522984 0.005448
O  -4.467477 1.232013 0.000809
O  -4.474463 -1.101944 0.004109
N  0.560802 0.333905 0.000251
C  2.693853 -0.775258 0.003097
C  1.966699 0.460459 -0.000201
C  0.182107 -0.925188 0.0037
C  4.100581 -0.804854 0.003078
C  2.673028 1.685863 -0.003564
C  4.789959 0.430027 -0.000312
C  4.082132 1.661443 -0.003591
C  -2.346805 0.173412 0.000844
C  -3.852139 -0.018201 0.002203
C  -5.953389 1.21686 0.001492
H  4.652881 -1.749316 0.005615
H  2.113533 2.625997 -0.006074
H  5.885095 0.43187 -0.000387
H  4.639361 2.604161 -0.006177
H  -2.0174 0.736921 0.887641
H  -2.018389 0.731464 -0.889785
H  -6.327966 0.699191 -0.897178
H  -6.242002 2.276676 0.000437
H  -6.327164 0.701185 0.901638
