program: Gaussian 09
title: 000257591
version: EM64L-G09RevD.01
frameworkgroup: C1[X(C14H14O6S3)]
method: RPBEPBE
basis: SDD
operation: Freq
keyword: #p
keyword: freq=noraman
keyword: PBEPBE/SDD
title: #p freq=noraman PBEPBE/SDD
converged: YES YES NO NO
title: Mulliken charges:
elementType: S S S O O O O O O C C C C C C C C C C C C C C H H H H H H H H H H H H H H
charge: 0.843712 0.845425 -0.139347 -0.466785 -0.494107 -0.469404 -0.517559 -0.254404 -0.254257 -0.133582 -0.142242 -0.222267 -0.208749 -0.176054 -0.183909 -0.324674 -0.319517 -0.340645 -0.321074 0.344032 0.344386 -0.537759 -0.537468 0.290244 0.288054 0.326903 0.284561 0.255901 0.258063 0.269903 0.267732 0.229309 0.253492 0.227446 0.230068 0.254618 0.229951
chargesum: 0.00000
title: Mulliken charges with hydrogens summed into heavy atoms:
elementType: S S S O O O O O O C C C C C C C C C C C C C C
charge: 0.843712 0.845425 -0.139347 -0.466785 -0.494107 -0.469404 -0.517559 -0.254404 -0.254257 -0.133582 -0.142242 0.067977 0.079305 0.150849 0.100652 -0.068772 -0.061453 -0.070742 -0.053342 0.344032 0.344386 0.172489 0.177170
polarizability: 4.49620906e+02 -3.39496693e+00 2.60787136e+02 9.66173094e+00 7.81199889e+00 1.85359033e+02
1716.lowfreq: -3.6153 -2.0324 -0.0016 -0.0015 -0.0012 4.8763 11.3326 23.0259 28.5774
frequency: 11.3004 22.8909 28.5682 37.6722 46.7044 54.5590 65.3831 87.7697 95.4102 117.2949 124.7186 143.4456 145.8995 151.4200 180.7606 201.8376 204.7804 213.5543 227.5012 232.4313 244.9590 247.6501 255.6644 301.9646 304.8761 342.1572 346.6577 383.5909 388.6512 400.5297 415.9166 417.7572 436.4599 471.0761 474.0861 518.0934 521.1355 584.3571 585.0508 614.1627 614.6806 712.1482 712.5691 759.1663 760.4903 799.8447 808.0768 812.7356 814.4115 837.7550 839.9390 932.3525 943.1193 954.7786 955.9946 970.0870 971.1025 976.2870 976.4758 982.3739 982.9574 1043.1088 1045.2781 1111.7937 1112.0943 1112.8162 1122.1229 1156.6590 1159.1642 1174.3574 1180.8875 1239.9644 1241.7553 1290.1344 1304.7905 1386.3920 1387.5246 1414.6669 1416.4210 1435.7203 1436.1844 1467.6528 1468.1028 1470.1280 1471.7538 1474.1424 1476.8531 1579.9438 1581.4140 1594.9703 1596.4510 2969.7524 2972.1861 3062.5475 3065.8639 3135.4231 3135.5994 3137.7682 3156.6197 3157.2052 3161.4280 3175.7908 3176.6603 3178.0748 3182.0565
redmass: 6.0501 5.2094 5.0807 5.3794 6.8837 8.2509 8.7400 4.2840 4.8569 7.0688 7.1483 4.7445 6.2277 9.7629 11.8002 3.6558 5.4857 7.1289 1.3778 1.4277 4.8908 6.8635 7.4210 6.1838 5.2057 6.6082 6.8007 12.5038 12.4578 10.0500 2.9924 3.0869 9.2083 4.5279 4.6583 2.9031 3.0118 6.3873 6.4145 7.0669 7.0762 3.3147 3.3222 5.8605 5.8184 15.1061 15.3710 1.2973 1.2718 1.6231 1.6081 15.9259 18.0553 1.3353 1.3311 1.6583 1.3579 3.8683 7.8581 4.7542 5.6882 2.4286 2.4851 1.2591 1.2810 1.2728 1.3674 1.3182 1.3210 1.1929 1.1985 3.5504 3.4099 1.2603 1.2704 5.3900 5.4683 4.0717 4.4216 1.2067 1.1915 1.3448 1.2787 1.0806 1.0497 1.4046 1.6365 6.5251 7.0265 6.5085 6.4727 1.0327 1.0326 1.1045 1.1046 1.0945 1.0989 1.1003 1.0891 1.0886 1.0890 1.0955 1.0958 1.0954 1.0974
irintensity: 1.7761 0.9553 0.7320 0.2128 0.1536 0.2519 0.9412 1.0601 0.3443 2.5178 2.6413 9.2804 8.9723 5.1768 0.5925 7.1270 2.7892 13.9326 2.0082 2.3151 1.3143 0.6458 4.8161 66.3993 1.1075 0.0640 0.8832 29.5134 31.1136 389.3607 0.3840 14.8413 23.0896 68.5299 28.1183 75.6052 48.0905 13.9825 2.0131 1.1187 1.0905 2.6546 1.1482 13.9772 10.7186 54.5412 96.7403 13.1175 5.4626 60.2420 88.7667 66.3915 40.9253 1.4277 0.1549 4.0257 1.2613 27.4994 34.0344 21.5300 30.3209 44.5087 52.4358 0.3648 6.0814 4.4624 9.8964 12.8234 5.4424 181.8262 106.0328 356.1712 182.6313 3.0772 3.4549 14.9849 20.3762 4.7923 8.4383 27.0316 22.9852 187.1376 55.2998 28.0360 16.1442 1.9175 21.9108 50.5495 64.8906 161.1826 131.5712 75.0845 69.5977 37.4964 36.4492 31.8319 10.6643 20.3904 2.3964 2.1437 0.6181 5.6919 8.4771 11.4108 6.8680
temp: 298.150 k
press: 1.00000 atm
elementType: 16 16 16 8 8 8 8 8 8 6 6 6 6 6 6 6 6 6 6 6 6 6 6 1 1 1 1 1 1 1 1 1 1 1 1 1 1
symmnumber: 1
zpe: 672219.2 jmol-1
zpe.correction: 0.256035 hartree
zpe.thermalcorrener: 0.281033 hartree
zpe.thermalcorrenthalpy: 0.281977 hartree
zpe.thermalcorrgfe: 0.197520 hartree
zpe.sumelectzpe: -2185.370329 hartree
zpe.sumelectthermal: -2185.345331 hartree
zpe.sumelectthermalent: -2185.344387 hartree
zpe.sumelectthermalfe: -2185.428844 hartree
dipole: 2.5362 8.3145 -3.3713
dipole: 9.3236
quadrupole: -76.3199 -171.3253 -166.4813
quadrupole: -19.3351 -0.3000 -1.3423
quadrupole: 61.7223 -33.2831 -28.4391 -19.3351 -0.3000 -1.3423
hfenergy: -2185.6263642 hartree
pointgroup: C01 [X(C14H14O6S3)]
dipole: 0.800352 -3.5645914 -0.3295258 debye
polarizability: 449.6275999|-3.6229673|238.4238575|-8.2894092|35.625076|207.7156176 unknown
InChI: InChI=1S/2C7H7O3S.S/c2*1-10-6-2-4-7(5-3-6)11(8)9;/h2*2-5H,1H3;
charge 0 multiplicity 1
37 atoms
S  -1.990838 1.885392 1.783287
S  1.283382 1.471057 -0.043451
S  0.214479 0.734194 2.06321
O  -1.717479 3.203637 0.873627
O  -2.623756 1.991986 3.279923
O  1.910216 2.962138 0.106821
O  0.280805 1.101795 -1.278383
O  -5.381446 -1.931745 -1.428289
O  5.811611 -2.516871 -0.159562
C  -3.025352 0.663289 0.814416
C  2.697893 0.245926 -0.05081
C  -4.02822 -0.030909 1.508231
C  3.922235 0.654709 0.501055
C  -2.771894 0.509218 -0.563516
C  2.487385 -1.025831 -0.620969
C  -4.850597 -0.91603 0.780153
C  5.001713 -0.252994 0.480051
C  -3.593349 -0.377502 -1.278133
C  3.565951 -1.923702 -0.64038
C  -4.631422 -1.086871 -0.613101
C  4.819959 -1.543041 -0.086996
C  -6.48119 -2.68884 -0.815993
C  7.137737 -2.200705 0.389658
H  -4.174595 0.13119 2.580709
H  4.035289 1.66061 0.917736
H  -1.955342 1.04793 -1.057443
H  1.518225 -1.291773 -1.05335
H  -5.646244 -1.454618 1.301532
H  5.963072 0.051997 0.901416
H  -3.449435 -0.537741 -2.350124
H  3.466048 -2.921992 -1.07511
H  -7.240168 -2.009183 -0.384202
H  -6.923284 -3.264058 -1.641655
H  -6.105708 -3.37936 -0.037105
H  7.079205 -1.988306 1.473837
H  7.737419 -3.105732 0.219117
H  7.593695 -1.343362 -0.14051
