program: Gaussian 09
title: 000257590
version: EM64L-G09RevD.01
frameworkgroup: C1[X(C12H8Cl2O4S3)]
method: RPBEPBE
basis: SDD
operation: Freq
keyword: #p
keyword: freq=noraman
keyword: PBEPBE/SDD
title: #p freq=noraman PBEPBE/SDD
converged: YES YES NO NO
title: Mulliken charges:
elementType: Cl Cl S S S O O O O C C C C C C C C C C C C H H H H H H H H
charge: -0.012797 -0.020209 0.846256 0.845317 -0.122286 -0.513254 -0.457720 -0.480703 -0.458492 -0.104370 -0.097677 -0.197020 -0.216161 -0.202796 -0.188464 -0.176035 -0.181312 -0.175000 -0.195830 -0.102572 -0.100728 0.289459 0.298795 0.296695 0.330698 0.273306 0.272969 0.274933 0.275000
chargesum: 0.00000
title: Mulliken charges with hydrogens summed into heavy atoms:
elementType: Cl Cl S S S O O O O C C C C C C C C C C C C
charge: -0.012797 -0.020209 0.846256 0.845317 -0.122286 -0.513254 -0.457720 -0.480703 -0.458492 -0.104370 -0.097677 0.092438 0.082634 0.093898 0.142234 0.097272 0.091657 0.099932 0.079170 -0.102572 -0.100728
polarizability: 3.86664880e+02 -7.57864194e-01 2.49085641e+02 1.12735692e+01 7.81184901e+00 1.70104474e+02
1716.lowfreq: -7.5701 -4.3218 -0.0016 -0.0012 -0.0010 0.8048 10.1889 23.2845 31.3771
frequency: 10.0709 23.0674 31.3482 36.9368 45.5578 52.7514 69.3875 100.8785 105.3431 123.0155 128.7543 149.0424 177.7288 202.4182 205.5248 219.0501 242.9229 257.2329 264.3164 276.5941 282.1291 356.7915 360.2079 367.4399 373.9620 383.6181 408.6420 408.8572 415.3807 480.8406 482.7779 499.9819 509.2604 607.7530 608.7679 693.4719 693.8234 700.8790 705.3098 801.4008 809.9947 823.7387 825.7598 832.1638 833.0054 936.3711 947.0926 958.5207 959.9184 970.5744 973.0758 974.6305 977.3265 1041.0188 1043.5611 1067.5099 1068.0300 1107.7280 1113.9732 1178.0402 1186.3466 1283.9311 1292.4040 1380.7611 1380.9875 1382.8501 1383.8449 1448.0959 1452.1283 1561.6092 1564.1989 1589.4619 1590.1117 3134.9575 3161.9016 3162.2936 3163.5714 3179.1966 3181.5688 3182.2449 3184.0575
redmass: 12.7930 6.9315 6.2453 6.0270 8.4065 15.1875 11.9573 10.7042 10.9813 10.2336 11.9731 16.1589 16.6278 15.8657 14.0699 19.4852 15.2392 9.6717 11.6585 8.3938 8.8230 6.4047 5.8594 18.2517 15.7060 10.3777 2.9112 2.9635 9.6824 7.9009 7.9886 3.7012 4.3883 7.1256 7.1285 4.7651 4.5040 6.1490 5.6809 15.5878 16.1412 1.2757 1.2546 1.4066 1.4235 13.7767 18.7517 1.3731 1.3250 1.9071 1.3747 2.9320 7.0045 2.8179 2.7010 3.0497 3.1617 1.3242 1.3466 1.1280 1.1463 1.2317 1.2444 6.7149 3.3521 10.7038 2.9205 2.0949 1.9977 5.8704 6.1151 8.0091 8.1432 1.0936 1.0900 1.0896 1.0894 1.0949 1.0967 1.0973 1.0978
irintensity: 0.1783 0.2239 0.0242 0.0723 0.1092 0.5958 0.8307 2.6944 1.0963 3.5176 5.3744 0.5422 0.5356 1.7094 3.9245 10.7944 4.4242 0.2212 2.4576 5.3643 32.6341 5.1787 1.4217 84.0138 81.7826 211.6620 0.8538 3.6427 10.2827 12.6207 6.7902 146.1137 60.9422 1.0424 0.4809 10.9112 8.9813 32.3387 23.4515 55.3670 98.1979 5.4682 4.4143 38.3110 74.4060 60.2866 39.8801 2.3630 0.5494 12.9503 0.1066 30.3469 38.5130 37.6188 45.6588 85.7233 64.8729 6.2615 7.1210 20.0056 12.1938 2.0593 1.8191 9.9813 11.9183 7.0011 14.4695 56.6931 63.6958 41.9886 56.0535 3.4626 1.2983 29.1521 3.5186 3.8812 1.7709 0.7513 0.2194 3.7744 3.4359
temp: 298.150 k
press: 1.00000 atm
elementType: 17 17 16 16 16 8 8 8 8 6 6 6 6 6 6 6 6 6 6 6 6 1 1 1 1 1 1 1 1
symmnumber: 1
zpe: 455488.9 jmol-1
zpe.correction: 0.173487 hartree
zpe.thermalcorrener: 0.195731 hartree
zpe.thermalcorrenthalpy: 0.196675 hartree
zpe.thermalcorrgfe: 0.117182 hartree
zpe.sumelectzpe: -2875.437514 hartree
zpe.sumelectthermal: -2875.415270 hartree
zpe.sumelectthermalent: -2875.414325 hartree
zpe.sumelectthermalfe: -2875.493818 hartree
dipole: 1.9154 5.5445 -1.7975
dipole: 6.1353
quadrupole: -139.9256 -174.5045 -165.1489
quadrupole: -8.5961 2.5926 3.7928
quadrupole: 19.9341 -14.6449 -5.2892 -8.5961 2.5926 3.7928
hfenergy: -2875.6110004 hartree
pointgroup: C01 [X(C12H8Cl2O4S3)]
dipole: -0.6599204 -2.2937974 0.3597619 debye
polarizability: 387.1807446|3.0577694|225.5303409|-0.8199155|-37.2076976|193.1439098 unknown
InChI: InChI=1S/2C6H4ClO2S.S/c2*7-5-1-3-6(4-2-5)10(8)9;/h2*1-4H;
charge 0 multiplicity 1
29 atoms
Cl -6.368183 -2.613675 -0.099974
Cl 5.352617 -2.686286 1.899148
S  -1.313356 1.373751 0.215723
S  2.032674 1.727111 -1.42158
S  -0.179556 0.659475 -1.86854
O  -0.389904 0.915153 1.481173
O  -1.87972 2.88932 0.093775
O  2.758059 1.876695 -2.868802
O  1.758032 3.002587 -0.455678
C  -2.780562 0.196904 0.10948
C  2.968052 0.408699 -0.451019
C  -2.641313 -1.09012 0.655371
C  3.964884 -0.30706 -1.134269
C  -3.956441 0.674623 -0.493619
C  2.646525 0.22971 0.904567
C  -3.755628 -1.955153 0.592691
C  4.703828 -1.261755 -0.401249
C  -5.065922 -0.197409 -0.553726
C  3.391101 -0.729306 1.627197
C  -4.943728 -1.495724 -0.015212
C  4.402509 -1.455607 0.963184
H  -1.707312 -1.40356 1.131085
H  4.170255 -0.115699 -2.19189
H  -4.013766 1.69443 -0.886481
H  1.839847 0.796161 1.383697
H  -3.698245 -2.96524 1.006979
H  5.496941 -1.838854 -0.883942
H  -6.00377 0.129183 -1.010736
H  3.181283 -0.905551 2.685548
