program: Gaussian 09
title: 000257588
version: EM64L-G09RevD.01
frameworkgroup: C1[X(C8H12N2O2S)]
method: RPBEPBE
basis: SDD
operation: Freq
keyword: #p
keyword: freq=noraman
keyword: PBEPBE/SDD
title: #p freq=noraman PBEPBE/SDD
converged: YES YES NO NO
title: Mulliken charges:
elementType: S O O N N C C C C C C C C H H H H H H H H H H H H
charge: 0.880174 -0.571773 -0.572851 -0.605673 -0.689871 -0.504052 -0.088402 -0.360236 -0.233663 -0.234725 -0.390275 -0.390035 0.510199 0.260961 0.260004 0.248882 0.250396 0.281282 0.282379 0.228104 0.228064 0.293709 0.292488 0.312475 0.312438
chargesum: 0.00000
title: Mulliken charges with hydrogens summed into heavy atoms:
elementType: S O O N N C C C C C C C C
charge: 0.880174 -0.571773 -0.572851 -0.019477 -0.064958 0.016913 -0.088402 0.139042 0.047619 0.047655 -0.162170 -0.161971 0.510199
polarizability: 2.05442853e+02 1.58066463e+00 1.22490579e+02 7.51141178e+00 -7.22327095e+00 8.93835379e+01
1716.lowfreq: -9.7243 0.0008 0.0018 0.0019 1.7650 5.9376 19.1503 45.3356 46.9689
frequency: 18.9403 45.3137 46.9436 85.2149 106.5300 120.7715 133.7480 188.7711 220.3659 235.2854 274.2383 299.9348 312.4232 321.1818 383.5758 398.4044 400.5364 411.7691 413.7075 473.2525 514.3098 584.4177 608.4035 623.3605 715.8753 757.9397 782.3371 808.3992 819.0709 834.6487 880.2613 933.3922 952.3436 964.8489 983.4493 1018.2919 1022.9061 1052.3681 1056.3154 1107.3997 1127.1038 1179.9068 1210.2201 1250.1882 1295.6199 1317.5567 1330.4346 1367.0039 1396.8043 1397.2763 1429.4676 1476.0380 1489.4355 1587.2067 1613.5625 1629.1187 1645.9043 2998.6046 3049.4785 3061.3462 3128.9033 3130.7777 3148.7815 3153.3861 3156.6679 3558.4683 3563.8128 3694.7195 3703.0924
redmass: 3.3434 5.2832 3.1353 2.1797 1.1357 5.4789 4.6371 4.1399 8.9035 4.1908 4.6854 3.8818 5.0682 1.5032 6.6122 2.1756 1.1997 1.3045 2.7943 9.2382 2.8369 5.6260 7.1017 6.9122 3.0210 1.1590 14.6030 4.9380 1.2556 1.8655 2.5899 1.7389 1.3415 1.3557 4.7390 1.4251 5.0033 2.5332 1.1777 4.0342 1.1917 1.1208 1.2028 1.4373 1.2994 2.6655 1.0999 1.2350 1.1057 5.6150 3.7024 1.0791 2.9498 7.4125 4.6918 1.0974 1.2325 1.0597 1.0553 1.1052 1.0886 1.0884 1.1116 1.0954 1.0969 1.0447 1.0451 1.1031 1.1040
irintensity: 0.2617 3.1622 0.8007 0.4750 9.6587 3.2061 1.7298 27.7266 8.2328 0.1014 0.1351 34.7934 2.1840 274.1301 0.7264 1.0238 0.0837 335.0227 0.0019 116.4009 42.0442 4.4555 28.8979 0.5502 2.9650 4.0854 71.3884 24.6187 0.8008 72.0460 61.3896 17.7668 1.8480 0.0154 2.0329 0.4357 52.1372 58.3593 14.3534 85.8383 13.7886 39.0166 4.8129 1.2865 4.3886 77.3832 0.0497 7.6781 9.4098 5.5442 1.4163 10.5374 77.8399 7.5859 139.1610 34.0106 263.8879 20.9110 8.5980 8.4501 13.9300 13.1810 4.0462 2.9070 17.5967 15.3471 99.2910 14.7224 24.4276
temp: 298.150 k
press: 1.00000 atm
elementType: 16 8 8 7 7 6 6 6 6 6 6 6 6 1 1 1 1 1 1 1 1 1 1 1 1
symmnumber: 1
zpe: 508425.7 jmol-1
zpe.correction: 0.193649 hartree
zpe.thermalcorrener: 0.208718 hartree
zpe.thermalcorrenthalpy: 0.209663 hartree
zpe.thermalcorrgfe: 0.150062 hartree
zpe.sumelectzpe: -968.907094 hartree
zpe.sumelectthermal: -968.892025 hartree
zpe.sumelectthermalent: -968.891081 hartree
zpe.sumelectthermalfe: -968.950681 hartree
dipole: -3.9649 -1.2209 -5.7742
dipole: 7.1100
quadrupole: -44.6876 -83.0811 -96.2704
quadrupole: -1.2051 -5.9227 -3.0901
quadrupole: 29.9921 -8.4014 -21.5907 -1.2051 -5.9227 -3.0901
hfenergy: -969.1007436 hartree
pointgroup: C01 [X(C8H12N2O2S1)]
dipole: -1.5682161 -2.3134826 -0.115274 debye
dipolederiv: 1.8650477 0.1349566 -0.0103428 0.0545693 1.2218118 0.0047732 -0.0159258 0.0052428 1.0766759 -0.7626975 -0.0099079 0.041124 0.0513214 -0.6229406 0.0496109 0.0684856 0.1778481 -0.6215965 -0.7707024 -0.0117168 -0.0368973 0.0559065 -0.590526 -0.0461172 -0.058161 -0.1701549 -0.6467214 -1.154685 -0.0030037 0.0213745 0.1529277 -0.8329177 -0.0312758 0.0196883 -0.0279378 -0.1806334 -1.7170627 -0.1955522 0.0245572 -0.2794269 -0.787422 -0.0359562 0.0198516 -0.0375899 -0.0914528 -0.1092043 -0.144159 -0.0075457 -0.5228751 0.0604445 0.0160055 -0.0341567 0.0071168 -0.049095 -0.5360802 -0.0539926 0.0006118 0.054018 -0.3075549 0.0022568 0.0090679 0.0027625 -0.3436743 0.927112 -0.3690885 -0.0374081 0.1443992 0.2527296 -0.0072015 0.0055523 -0.0006336 0.14786 0.1622828 0.0716785 0.0837173 0.0247112 -0.0596826 -0.0247228 0.3231452 0.0457668 0.0750288 0.1428348 0.0782826 -0.0776065 0.0639257 -0.0550826 0.0051166 -0.3216052 -0.0659763 0.0866819 -0.484916 -0.0484342 0.0078636 -0.1024975 -0.2304853 -0.0216726 0.402568 0.0686342 0.0443088 -0.5029417 -0.0516909 0.0102581 -0.0538701 -0.2208176 -0.0088187 -0.3873725 -0.0997163 0.053133 1.7815747 0.359962 -0.0172127 0.4187474 0.2532004 0.0039463 -0.0142183 0.004564 0.0350812 0.0059069 0.0292862 0.0403731 -0.0252871 -0.0111844 0.0517717 0.0792898 0.0493512 -0.0007748 0.0047784 0.0344596 -0.0361575 -0.0085394 0.0045999 -0.0501526 -0.0804696 -0.0495365 -0.0164616 0.0554276 0.024142 0.0167903 -0.0320833 -0.0064871 0.0790691 0.0649718 0.1035389 -0.0103345 0.0636742 0.024227 -0.0138068 -0.0212584 0.0296464 -0.068389 -0.0713356 -0.090443 -0.0331105 0.136685 -0.0165899 0.0686822 -0.0013176 0.1372685 0.0331567 0.0398382 0.0100039 0.0485366 0.1338372 -0.0077052 -0.073646 0.0032329 0.1414836 -0.0217424 -0.0428138 0.0015053 0.0511296 -0.0482466 -0.0390068 -0.1024783 -0.0459068 0.1628096 -0.0075416 -0.0946292 -0.0024874 -0.0451927 -0.0397252 -0.0503489 0.096592 -0.0562065 0.1581199 0.0353039 0.0881935 0.0298668 -0.0492114 0.1746241 0.1633558 -0.0338226 0.0834551 0.2752864 -0.0131674 -0.0082292 -0.0082493 0.1146624 0.1893011 0.1561189 0.0449122 0.08962 0.2694369 0.0235204 0.0165861 0.0137446 0.1102058 0.2401168 -0.0369583 -0.0202742 -0.0208042 0.3802436 0.0079536 -0.0554497 0.0048765 0.1227707 0.2430583 -0.0383144 0.0103422 -0.0267615 0.3780198 0.0242731 0.0471284 0.0279027 0.122184 unknown
polarizability: 205.4662934|7.3231062|87.9959434|-1.1534498|-2.5219178|123.8547324 unknown
InChI: InChI=1S/C8H12N2O2S/c9-5-6-13(11,12)8-3-1-7(10)2-4-8/h1-4H,5-6,9-10H2
charge 0 multiplicity 1
25 atoms
S  1.304943 0.800623 -0.012431
O  1.580757 1.636099 -1.401863
O  1.647595 1.432504 1.466816
N  4.64812 -1.684464 -0.213324
N  -4.574097 -0.728557 0.02631
C  2.352822 -0.830388 -0.150059
C  -0.503119 0.28785 -0.004067
C  3.851203 -0.460576 -0.121461
C  -1.190055 0.215558 -1.229411
C  -1.134275 0.065409 1.233167
C  -2.553677 -0.128163 -1.218147
C  -2.498038 -0.27754 1.24174
C  -3.225857 -0.38704 0.016443
H  2.045997 -1.439271 0.714778
H  2.039379 -1.286938 -1.102127
H  4.068548 0.230823 -0.957216
H  4.067343 0.088144 0.813811
H  -0.670902 0.454953 -2.163868
H  -0.571963 0.190736 2.164924
H  -3.108748 -0.187386 -2.161705
H  -3.010243 -0.452038 2.195219
H  5.134956 -2.009164 0.617756
H  5.080498 -1.915185 -1.103951
H  -5.064375 -0.89323 0.900716
H  -5.103713 -0.788457 -0.838549
