program: Gaussian 09
title: 000257586
version: EM64L-G09RevD.01
frameworkgroup: C1[X(C9H11NO3S)]
method: RPBEPBE
basis: SDD
operation: Freq
keyword: #p
keyword: freq=noraman
keyword: PBEPBE/SDD
title: #p freq=noraman PBEPBE/SDD
converged: YES YES NO NO
title: Mulliken charges:
elementType: S O O O N C C C C C C C C C H H H H H H H H H H H
charge: 0.919942 -0.548626 -0.555213 -0.246040 -0.454829 -0.116989 -0.240072 -0.226399 0.497932 -0.320181 -0.423999 -0.740893 0.229877 -0.778027 0.284449 0.290953 0.320875 0.232196 0.266847 0.293478 0.264316 0.308120 0.214977 0.263379 0.263927
chargesum: 0.00000
title: Mulliken charges with hydrogens summed into heavy atoms:
elementType: S O O O N C C C C C C C C C
charge: 0.919942 -0.548626 -0.555213 -0.246040 -0.146709 -0.116989 0.044377 0.064554 0.497932 0.000694 -0.191803 0.083747 0.229877 -0.035744
polarizability: 2.21731610e+02 1.07776218e+00 1.34874277e+02 2.60943486e+00 6.80910085e-01 8.30455267e+01
1716.lowfreq: -7.8326 -0.0002 0.0021 0.0026 5.2721 6.7992 36.3067 40.3320 54.5967
frequency: 36.2938 40.2987 54.5897 74.2778 97.0107 114.4157 158.9821 175.0937 187.3375 206.7160 234.5949 300.6950 311.7075 344.4765 376.3465 378.4512 413.8179 422.3158 517.0209 540.7474 586.1909 597.5499 619.6807 653.4817 675.0427 727.3148 785.8778 823.4143 837.2641 870.3621 885.5166 930.5280 963.2284 967.6094 989.7967 995.4120 998.8774 1006.2721 1040.7636 1056.4562 1119.6413 1181.7545 1214.3459 1263.2140 1293.8475 1300.7994 1369.3880 1390.6497 1404.7356 1407.8892 1421.7308 1448.4763 1469.4680 1475.9499 1501.6605 1595.8329 1600.6717 1632.0704 2997.8591 3029.3745 3098.2129 3102.3858 3122.2883 3151.7115 3157.7306 3179.3070 3183.4213 3197.9440 3534.1276
redmass: 3.3983 1.7010 2.2070 4.3255 5.9195 3.6751 1.2191 3.6609 4.1663 6.8351 4.2608 6.5773 7.4121 5.3670 5.5694 5.1220 2.9727 5.8532 2.9474 4.3151 6.4914 3.2097 6.9667 1.1917 6.0066 3.4060 12.0045 4.7316 1.4159 1.4519 3.1035 6.0220 1.3530 1.4113 2.8460 1.8819 1.3361 1.8617 1.6401 2.4370 1.3083 1.1258 3.4361 1.8720 1.4123 1.1409 4.1684 1.2324 4.5594 1.0529 1.0604 1.0455 1.1626 2.0715 2.2633 6.8896 5.7803 4.9025 1.0363 1.0246 1.0993 1.0993 1.0899 1.0913 1.0954 1.1070 1.1078 1.0949 1.0765
irintensity: 4.9383 4.3569 2.1634 5.5769 2.0820 4.0696 0.5270 2.2592 1.5885 6.6285 1.1388 14.7950 3.4507 32.2264 7.4769 0.5918 0.0016 26.1091 21.1668 26.5719 96.8572 12.3865 4.5338 58.1792 4.0826 2.5926 73.1365 4.0601 33.4374 51.3829 33.6002 3.4089 6.0489 61.5362 20.3233 6.0072 3.1148 56.1614 15.7456 50.8901 9.5351 25.0050 60.6802 55.4413 49.8109 4.1818 248.2855 46.7105 11.5099 8.2338 16.7656 16.3582 15.7560 33.9232 420.2511 95.8292 26.2623 112.3323 10.0021 1.2877 12.0680 11.3005 13.5166 1.7501 8.3725 0.9449 1.4013 8.9498 14.7286
temp: 298.150 k
press: 1.00000 atm
elementType: 16 8 8 8 7 6 6 6 6 6 6 6 6 6 1 1 1 1 1 1 1 1 1 1 1
symmnumber: 1
zpe: 489525.8 jmol-1
zpe.correction: 0.186451 hartree
zpe.thermalcorrener: 0.201457 hartree
zpe.thermalcorrenthalpy: 0.202401 hartree
zpe.thermalcorrgfe: 0.142947 hartree
zpe.sumelectzpe: -1026.850928 hartree
zpe.sumelectthermal: -1026.835921 hartree
zpe.sumelectthermalent: -1026.834977 hartree
zpe.sumelectthermalfe: -1026.894431 hartree
dipole: -5.4405 3.7530 4.3916
dipole: 7.9354
quadrupole: -90.6661 -92.3666 -91.9599
quadrupole: -16.1705 16.8031 -1.1574
quadrupole: 0.9981 -0.7024 -0.2957 -16.1705 16.8031 -1.1574
hfenergy: -1027.0373785 hartree
pointgroup: C01 [X(C9H11N1O3S1)]
dipole: -2.1469455 -1.4306814 -1.7580413 debye
dipolederiv: 2.0399997 0.0590633 -0.0225688 0.1287898 1.1503013 -0.0216667 -0.0894318 -0.0280046 1.37336 -0.7412989 -0.052095 0.0094168 -0.1498181 -0.6118851 -0.1452753 0.0090036 -0.0183065 -0.5839002 -0.7897124 0.0414472 -0.0121294 0.10467 -0.6284182 0.1311776 0.0373537 0.0067945 -0.5508271 -0.715762 -0.0728178 0.0016167 0.5002769 -0.9352267 -0.0242421 0.0184422 -0.0202594 -0.3535989 -2.0501425 0.2992218 0.0265117 0.4534113 -0.4237999 -0.0065186 0.0072074 -0.0048052 -0.3235502 -0.3621879 0.0226465 -0.0278083 -0.0033967 -0.1973881 -0.0008264 -0.004008 0.000596 -0.2547243 0.0229878 0.0531632 0.0228409 -0.2454298 0.029214 0.0181009 -0.0184712 0.0427103 -0.0829229 -0.0456133 -0.0715643 0.0139303 0.2265066 0.0300213 0.0004536 0.0123241 -0.0280169 -0.0872627 1.4829029 -0.0178784 -0.0053576 0.3189317 0.0674912 0.0002593 0.022565 0.0013846 0.1225085 -0.3962213 -0.0683288 0.0008929 -0.2184166 -0.0627349 0.0061175 0.002828 0.0069305 -0.1404056 -0.4086469 0.0776654 0.0102881 0.1642625 0.0503513 0.0132036 0.0198491 0.0117231 -0.1853632 -0.2732919 -0.0094862 -0.0014006 -0.0223132 -0.1149545 0.0206854 0.010439 0.0240498 -0.2772965 1.8534437 -0.1652895 -0.0153753 -1.0089413 1.2372111 0.0431098 -0.0527602 0.0361424 0.2065508 -0.4888633 -0.1287854 -0.0012553 -0.0918195 0.0077887 0.0050156 0.0145834 0.0076718 -0.0044234 0.1235329 -0.0552576 -0.0099885 -0.0325401 0.0500857 -0.0015118 -0.0067801 -0.0141856 0.1444394 0.1194505 0.0739078 -0.0012404 0.037293 0.077608 -0.0091635 -0.0026862 0.0049751 0.1510164 0.1493554 0.0407378 0.0029391 -0.0039866 0.0833851 -0.0075594 -0.000272 -0.0067096 0.181016 -0.0215813 -0.106382 -0.0045917 -0.0963801 -0.049244 -0.0106341 -0.0053321 -0.0116551 0.167935 0.0816042 0.0624229 0.0041723 0.0780959 0.0107972 0.0392847 -0.0128519 0.0381054 0.0145766 -0.0330138 -0.0178579 0.0068529 -0.0263779 0.1180232 0.00683 0.0673769 0.0110314 0.0673991 0.1075587 -0.043861 0.0008407 -0.053068 0.0012732 -0.0401028 -0.0205008 -0.0415925 -0.0077053 0.1728726 0.018579 -0.0007932 -0.0142331 0.0992772 -0.0098096 0.0036775 -0.0091877 0.3044804 0.0507326 0.047907 0.0043323 -0.0473208 -0.1500038 -0.0205844 -0.0042579 -0.0204911 0.1178095 0.0599115 0.0115674 -0.0580189 0.0110638 0.0716617 0.0746671 -0.1118459 0.0494544 0.0120499 0.0619827 0.0012747 0.0558933 -0.0092596 0.0891652 -0.0610109 0.1035481 -0.0383552 -0.0111613 unknown
polarizability: 221.6598045|-0.0603804|134.7343169|-4.3139043|2.6454786|83.2572922 unknown
InChI: InChI=1S/C9H11NO3S/c1-7(11)10-8-3-5-9(6-4-8)14(2,12)13/h3-6,10H,1-2H3
charge 0 multiplicity 1
25 atoms
S  3.329248 0.108283 0.107324
O  3.636248 1.498941 0.913783
O  3.960381 -1.334097 0.560736
O  -3.594572 1.481533 0.054837
N  -2.713215 -0.69421 -0.0267
C  1.453005 -0.108584 0.025491
C  0.634786 1.028552 0.112779
C  0.943844 -1.415801 -0.047959
C  -1.315002 -0.445969 -0.004843
C  -0.765847 0.864389 0.091426
C  -0.453343 -1.578679 -0.065844
C  3.869007 0.397498 -1.709688
C  -3.767479 0.230318 0.00617
C  -5.159808 -0.39382 -0.017486
H  1.080595 2.022635 0.22633
H  1.624509 -2.273623 -0.057495
H  -1.437372 1.72189 0.154275
H  -0.877938 -2.588851 -0.119535
H  3.364317 1.310651 -2.053403
H  4.960146 0.519195 -1.66086
H  3.575325 -0.495108 -2.278603
H  -2.982689 -1.679588 -0.069011
H  -5.160638 -1.494292 -0.10261
H  -5.726559 0.029595 -0.864044
H  -5.694451 -0.109659 0.905434
