program: Gaussian 09
title: 000257583
version: EM64L-G09RevD.01
frameworkgroup: C1[X(C11H17NO2S2)]
method: RPBEPBE
basis: SDD
operation: Freq
keyword: #p
keyword: freq=noraman
keyword: PBEPBE/SDD
title: #p freq=noraman PBEPBE/SDD
converged: YES YES NO NO
title: Mulliken charges:
elementType: S S O O N C C C C C C C C C C C H H H H H H H H H H H H H H H H H
charge: 0.506376 0.893076 -0.580935 -0.543643 -0.582530 -0.536927 -0.553890 -0.037453 -0.252187 -0.232128 -0.637647 -0.644031 0.452498 -0.365783 -0.369968 -0.802532 0.290257 0.251247 0.259508 0.325839 0.285671 0.269402 0.229225 0.274781 0.228061 0.244474 0.215157 0.243386 0.238792 0.236965 0.226165 0.227537 0.241241
chargesum: 0.00000
title: Mulliken charges with hydrogens summed into heavy atoms:
elementType: S S O O N C C C C C C C C C C C
charge: 0.506376 0.893076 -0.580935 -0.543643 -0.582530 0.004576 0.031456 -0.037453 0.033483 0.037274 0.094419 0.058986 0.452498 -0.126991 -0.133003 -0.107589
polarizability: 2.58718386e+02 1.18751921e+01 1.72364631e+02 -2.52059868e+00 1.07986587e+01 1.38295490e+02
1716.lowfreq: -3.3414 -0.0023 -0.0019 -0.0011 5.6792 10.9844 16.1933 19.4796 24.3945
frequency: 15.7953 19.0910 24.1302 34.9662 42.9548 66.0976 71.8153 113.5485 128.2993 137.4353 153.1857 160.6622 183.3802 219.0415 229.5079 246.9707 259.9956 289.8558 304.8524 335.0463 354.8070 374.9592 391.9645 408.2498 465.3716 498.3959 552.5124 565.0023 584.8589 596.5358 623.4199 626.4613 711.8694 770.6394 773.0067 780.3096 792.4361 825.9569 850.2611 903.9434 958.5593 980.2379 980.7460 985.0980 989.6686 998.0538 1038.9727 1048.5857 1058.1807 1059.7945 1062.2116 1089.9479 1115.7319 1181.7733 1218.1833 1228.4477 1244.3613 1269.0648 1283.3225 1294.0866 1381.6171 1391.3467 1394.7044 1395.8549 1397.7369 1426.3598 1447.6647 1463.5049 1471.9031 1471.9286 1473.6197 1474.8572 1476.0911 1485.7531 1596.5861 1598.7505 2978.6866 2985.6257 2994.2983 3026.4034 3028.2997 3060.7027 3073.9536 3086.8012 3088.1741 3088.9913 3100.5490 3117.1969 3122.3791 3130.1064 3132.3202 3159.8930 3163.2043
redmass: 1.0386 3.9796 3.5316 4.1345 3.1518 2.8849 3.0901 3.3237 4.8706 3.5377 3.7794 3.0640 2.1685 7.6707 1.3193 1.8975 3.3812 4.5584 4.7938 3.7879 3.8140 7.1716 5.7381 2.8705 8.0814 3.4715 5.1142 6.5939 5.0115 6.1715 7.2499 12.2050 3.2653 1.6081 1.8111 1.6059 4.2856 1.3966 1.2522 16.9570 1.3220 1.3889 1.6403 1.6401 1.3946 5.1095 1.4196 1.5895 1.5628 2.3237 2.1440 1.8633 1.2796 1.1510 2.9306 1.2274 1.2133 1.2121 1.2465 1.2669 5.8317 3.1071 1.1963 1.1939 1.2227 1.0937 1.0934 1.0371 1.0967 1.0400 1.0907 2.2464 1.0526 1.0485 6.9851 6.1193 1.0385 1.0361 1.0361 1.0585 1.0571 1.0951 1.0986 1.1010 1.0991 1.1000 1.1030 1.1082 1.1064 1.0892 1.0893 1.0950 1.0963
irintensity: 0.4374 1.5102 1.0733 2.5900 1.0661 0.9287 0.5278 1.5840 0.1549 2.3550 6.8078 0.6312 6.4682 10.3717 1.0796 1.3682 2.6497 7.7852 2.4104 2.5148 7.4361 8.1194 6.0345 0.0918 76.5305 28.8549 6.5557 47.5861 4.9897 12.4055 14.5748 152.6729 0.6504 42.9528 5.1919 5.6176 81.0130 26.1070 2.5229 100.3751 0.4552 1.5665 25.4595 23.3005 1.0569 2.9868 3.3697 23.6503 5.5877 20.0684 7.2830 7.5057 8.1699 12.8456 5.7449 6.1001 5.7625 9.0264 9.3817 2.4011 0.0756 8.0298 21.2893 24.2488 13.2450 6.9482 11.6020 13.1084 16.0803 16.8592 13.5571 20.9934 9.8014 12.1839 0.1941 9.4377 32.7784 27.0762 20.7225 11.8282 8.1777 20.5710 19.0313 10.9571 16.2883 16.5292 0.2717 11.0250 14.7728 16.5385 12.8483 3.8322 9.5169
temp: 298.150 k
press: 1.00000 atm
elementType: 16 16 8 8 7 6 6 6 6 6 6 6 6 6 6 6 1 1 1 1 1 1 1 1 1 1 1 1 1 1 1 1 1
symmnumber: 1
zpe: 677436.2 jmol-1
zpe.correction: 0.258022 hartree
zpe.thermalcorrener: 0.278050 hartree
zpe.thermalcorrenthalpy: 0.278994 hartree
zpe.thermalcorrgfe: 0.205443 hartree
zpe.sumelectzpe: -1429.210501 hartree
zpe.sumelectthermal: -1429.190473 hartree
zpe.sumelectthermalent: -1429.189529 hartree
zpe.sumelectthermalfe: -1429.263080 hartree
dipole: -2.7305 -0.4323 -6.8806
dipole: 7.4152
quadrupole: -70.5456 -107.0226 -123.6892
quadrupole: 1.1867 4.8024 1.6670
quadrupole: 29.8735 -6.6035 -23.2701 1.1867 4.8024 1.6670
hfenergy: -1429.4685233 hartree
pointgroup: C01 [X(C11H17N1O2S2)]
dipole: -1.0254411 1.1422047 -2.4809048 debye
polarizability: 259.0267993|9.4924964|155.4762275|4.891763|20.2009024|154.8754796 unknown
InChI: InChI=1S/C11H17NO2S2/c1-4-15(5-2)12-16(13,14)11-8-6-10(3)7-9-11/h6-9H,4-5H2,1-3H3
charge 0 multiplicity 1
33 atoms
S  -3.048213 0.242354 0.174844
S  -0.35225 -0.441138 1.153417
O  -0.822524 -1.99006 0.824683
O  -0.306473 0.027951 2.719333
N  -1.271492 0.705971 0.012291
C  -3.659495 1.833324 -0.684413
C  -3.270111 -1.051229 -1.247544
C  1.365059 -0.15097 0.434902
C  2.222818 0.730082 1.110846
C  1.742374 -0.854669 -0.719358
C  -3.598093 3.00568 0.296303
C  -4.718404 -1.530332 -1.368388
C  3.950671 0.23603 -0.579238
C  3.521818 0.919326 0.589111
C  3.046572 -0.651562 -1.221696
C  5.361042 0.422642 -1.110029
H  -2.972635 1.960914 -1.537631
H  -4.681155 1.608419 -1.034753
H  -2.880381 -0.550264 -2.149596
H  -2.565445 -1.835084 -0.921446
H  1.882671 1.230832 2.023172
H  1.044321 -1.551556 -1.193666
H  -4.271996 2.858857 1.158051
H  -2.56867 3.139766 0.667897
H  -3.904702 3.931351 -0.224483
H  -5.079016 -1.970965 -0.42254
H  -5.410857 -0.722654 -1.66784
H  -4.775749 -2.317794 -2.142665
H  4.210791 1.604915 1.096312
H  3.366691 -1.188614 -2.122398
H  5.408196 0.268292 -2.202176
H  5.747197 1.432928 -0.888472
H  6.055636 -0.303639 -0.644928
