program: Gaussian 09
title: 000257582
version: EM64L-G09RevD.01
frameworkgroup: C1[X(C16H12O2S)]
method: RPBEPBE
basis: SDD
operation: Freq
keyword: #p
keyword: freq=noraman
keyword: PBEPBE/SDD
title: #p freq=noraman PBEPBE/SDD
converged: YES YES NO NO
title: Mulliken charges:
elementType: S O O C C C C C C C C C C C C C C C C H H H H H H H H H H H H
charge: 0.283809 -0.216475 -0.211909 -0.236290 -0.522601 -0.009750 -0.341369 0.212800 -0.495995 0.426327 0.117547 0.307774 -0.233599 -0.552945 -0.403825 -0.366483 -0.239849 -0.236109 -0.240068 0.279270 0.237440 0.237623 0.219716 0.231069 0.278630 0.269391 0.255827 0.258189 0.229029 0.231812 0.231013
chargesum: 0.00000
title: Mulliken charges with hydrogens summed into heavy atoms:
elementType: S O O C C C C C C C C C C C C C C C C
charge: 0.283809 -0.216475 -0.211909 0.042980 -0.047538 -0.009750 0.109416 0.212800 -0.495995 0.426327 0.117547 0.307774 0.045031 -0.283554 -0.147998 -0.108294 -0.010820 -0.004296 -0.009055
polarizability: 2.54783227e+02 6.63676286e+00 2.27207789e+02 8.26883855e+00 -7.97906017e+00 1.07925914e+02
1716.lowfreq: -7.6836 -2.5061 -0.0007 0.0006 0.0017 6.3857 48.2994 58.8102 73.8204
frequency: 48.2843 58.7936 73.8143 90.1288 98.6539 166.4886 192.9950 204.8171 233.2996 249.4742 276.8833 300.0191 319.9638 390.8171 404.6530 433.4059 468.9732 487.3297 523.0946 577.0313 592.7833 597.3826 614.8320 640.0233 657.8245 678.6418 697.4242 703.4776 724.9861 731.3044 759.6633 776.3705 798.6240 848.3125 853.6310 895.6445 905.8480 926.8643 930.1269 955.1341 976.2749 989.6160 995.5993 998.4118 1021.2728 1043.7819 1072.1053 1073.8661 1087.8822 1091.1000 1161.9453 1165.6641 1174.4514 1187.3172 1197.2275 1202.1256 1219.7903 1262.5108 1292.4591 1297.2890 1325.0211 1331.5069 1345.6149 1372.6850 1382.9720 1433.3439 1448.5201 1477.0499 1480.2923 1483.3131 1526.7079 1579.8540 1606.3199 1609.4268 1665.6305 2941.9468 2956.8695 2998.1755 3045.8007 3096.7909 3125.3918 3135.2917 3147.8964 3161.7341 3179.9302 3187.4941 3242.2192
redmass: 5.5816 4.2566 5.8573 7.1051 4.0557 4.1229 5.4548 4.6242 4.6889 4.4525 5.3782 5.7426 7.0134 5.2670 2.8723 3.6055 4.4053 4.0301 5.9486 4.7066 5.9471 7.4901 6.2110 4.8616 7.3093 2.3654 2.7576 3.1400 1.9711 3.3938 4.0138 3.1119 4.3439 1.9117 2.1006 2.1886 1.3401 1.7883 1.6724 9.2734 1.3965 5.3392 1.4092 3.4808 2.9227 2.1228 2.2488 2.0737 1.6385 1.6545 2.5824 1.1890 1.0543 1.3278 1.1346 2.9002 1.7712 1.4070 2.4196 1.4405 1.4255 1.6735 1.5251 5.0104 6.0266 2.3036 1.1679 5.2299 1.1179 2.2853 6.3845 5.8701 10.5309 5.9953 12.8076 1.0720 1.0776 1.0645 1.0932 1.1022 1.0851 1.0887 1.0938 1.0985 1.0973 1.0919 1.1002
irintensity: 3.6009 0.7558 1.0985 0.4661 0.4191 3.8462 2.7006 1.0767 0.3902 4.9143 4.1269 0.5808 2.5220 0.4160 0.2558 2.7469 3.9676 5.5120 1.6491 1.5549 6.8804 3.6015 0.1050 6.3318 0.5798 30.1704 17.9162 34.4638 33.9118 52.2335 4.1345 28.6320 9.7778 25.2747 8.1052 35.2967 3.1179 10.0687 3.6641 102.1120 0.3234 8.7578 8.3129 137.7200 10.1279 0.4260 19.8275 2.3062 14.6872 25.2951 63.3786 8.1806 0.0379 4.5654 4.6428 49.4002 8.0940 20.2710 32.1046 1.4813 6.5920 4.3121 0.9252 5.9547 17.9306 12.0963 16.0819 21.1334 10.6408 7.9398 78.5292 9.3607 109.3549 3.7759 320.8726 14.0705 21.6833 63.0122 18.2807 31.0077 1.5486 4.7751 27.9569 31.9841 6.0741 1.6505 0.2499
temp: 298.150 k
press: 1.00000 atm
elementType: 16 8 8 6 6 6 6 6 6 6 6 6 6 6 6 6 6 6 6 1 1 1 1 1 1 1 1 1 1 1 1
symmnumber: 1
zpe: 614200.5 jmol-1
zpe.correction: 0.233937 hartree
zpe.thermalcorrener: 0.248976 hartree
zpe.thermalcorrenthalpy: 0.249920 hartree
zpe.thermalcorrgfe: 0.191201 hartree
zpe.sumelectzpe: -1164.082849 hartree
zpe.sumelectthermal: -1164.067810 hartree
zpe.sumelectthermalent: -1164.066866 hartree
zpe.sumelectthermalfe: -1164.125585 hartree
dipole: 3.6453 -3.6200 -0.1868
dipole: 5.1408
quadrupole: -107.4645 -121.6930 -115.3068
quadrupole: 16.7068 2.5776 -2.5080
quadrupole: 7.3569 -6.8716 -0.4854 16.7068 2.5776 -2.5080
hfenergy: -1164.3167858 hartree
pointgroup: C01[X(C16H12O2S1)]
dipole: 1.2922024 1.5309568 -0.2776298 debye
polarizability: 254.4271559|-7.1407487|219.5552507|-15.0012231|-28.3504251|115.9345241 unknown
InChI: InChI=1S/C16H12O2S/c17-16-15-11(9-18-16)8-13-12(6-7-19-13)14(15)10-4-2-1-3-5-10/h1-7,11H,8-9H2
charge 0 multiplicity 1
31 atoms
S  3.417021 2.240528 -0.623692
O  0.782006 -3.568762 0.453265
O  -1.397775 -2.774123 0.55213
C  2.04815 -1.505208 0.416684
C  2.882004 -0.63382 -0.548008
C  0.548733 -1.223782 0.314617
C  2.130762 -3.025978 0.143585
C  0.059199 0.052288 0.096582
C  2.399786 0.785106 -0.392736
C  1.071968 1.117655 -0.103019
C  -0.185794 -2.506851 0.443565
C  -1.385004 0.420183 0.011185
C  0.85632 2.552026 -0.039057
C  1.991863 3.294699 -0.288649
C  -1.84286 1.242149 -1.057336
C  -2.322667 -0.012317 0.986355
C  -3.201347 1.609233 -1.154828
C  -3.676972 0.371882 0.898778
C  -4.1238 1.179837 -0.172229
H  2.374655 -1.291095 1.456824
H  2.727804 -0.973499 -1.595675
H  3.96071 -0.731993 -0.329922
H  2.34803 -3.234748 -0.92149
H  2.848428 -3.562194 0.783312
H  -0.108839 3.000868 0.203586
H  2.124828 4.374585 -0.291415
H  -1.135053 1.570966 -1.826662
H  -1.991586 -0.649505 1.810246
H  -3.53902 2.227006 -1.994308
H  -4.384854 0.030697 1.661685
H  -5.178495 1.468568 -0.242573
