program: Gaussian 09
title: 000257580
version: EM64L-G09RevD.01
frameworkgroup: C1[X(C17H18O2S)]
method: RPBEPBE
basis: SDD
operation: Freq
keyword: #p
keyword: freq=noraman
keyword: PBEPBE/SDD
title: #p freq=noraman PBEPBE/SDD
converged: YES YES NO NO
title: Mulliken charges:
elementType: S O O C C C C C C C C C C C C C C C C C H H H H H H H H H H H H H H H H H H
charge: 0.210397 -0.276648 -0.243927 -0.590297 -0.538976 0.472802 0.352147 -0.408139 -0.398933 -0.150661 -0.227394 -0.232156 -0.240076 -0.283695 -0.214782 -0.262653 -0.208379 -0.230262 -0.237135 -0.661303 0.328646 0.232584 0.248314 0.233234 0.261238 0.224315 0.225809 0.227707 0.250011 0.287380 0.237676 0.222953 0.230173 0.228511 0.230601 0.217130 0.228820 0.254968
chargesum: 0.00000
title: Mulliken charges with hydrogens summed into heavy atoms:
elementType: S O O C C C C C C C C C C C C C C C C C
charge: 0.210397 -0.276648 -0.243927 -0.261650 -0.058078 0.472802 0.352147 -0.174906 -0.137695 -0.150661 -0.003079 -0.006348 -0.012369 -0.033683 0.072597 0.197975 0.021794 -0.001750 -0.006534 0.039615
polarizability: 2.61156616e+02 -3.45136410e+01 1.78275121e+02 1.21471699e+00 -5.95320614e+00 1.75254104e+02
1716.lowfreq: -13.0217 -4.0353 -1.8427 0.0016 0.0017 0.0023 16.2148 23.8898 34.8856
frequency: 13.8031 23.5819 34.8403 37.0132 43.2030 58.1456 75.1169 97.7546 106.7862 158.2055 172.1591 183.4580 200.8309 226.2388 237.1722 299.4029 327.7236 344.0054 372.7524 400.8567 404.3394 409.8935 456.1019 475.7347 523.0411 552.5756 608.6323 612.9001 616.7896 648.8861 674.2002 697.1604 705.5403 739.2848 750.9761 764.4335 769.1559 815.2450 825.3002 851.2602 854.6660 858.5927 921.5131 926.2872 965.7661 978.3581 980.0424 983.7684 990.3531 995.5045 996.6283 1004.8116 1017.4589 1026.7364 1052.0143 1071.8145 1077.5108 1081.9858 1095.1558 1115.2376 1155.6956 1169.2320 1172.1496 1172.7157 1189.0264 1190.4892 1201.0242 1210.8633 1275.2514 1308.3297 1311.6469 1320.7893 1337.7671 1354.8498 1373.3410 1382.5426 1393.0042 1427.0583 1440.1473 1456.4108 1462.4005 1462.7226 1463.3658 1483.2823 1483.8916 1584.1701 1589.1604 1591.9152 1612.5360 1634.5091 2993.8698 3016.4430 3032.0874 3071.8420 3086.8311 3088.6098 3095.4375 3113.3267 3121.2477 3124.3366 3126.1792 3134.3836 3136.6443 3146.5354 3147.8060 3154.0088 3162.6030 3166.8545
redmass: 4.8910 4.2598 4.3716 3.9458 3.2514 3.3231 5.5828 5.0893 6.1463 2.9405 5.9673 2.9375 3.1254 3.5105 2.6949 3.6929 4.5746 2.5442 3.4415 4.1967 2.8378 4.6795 3.4253 3.4637 3.6120 5.2203 6.1961 6.2043 6.3286 4.5522 6.8601 2.4165 1.9595 2.5873 1.5305 2.6545 2.0872 1.6054 3.4514 1.3198 2.1755 1.3623 1.3558 1.4567 2.0677 1.4301 1.4021 5.2732 5.3242 1.3057 1.3638 2.6445 3.5045 2.2451 4.0391 2.3713 1.6336 1.7192 2.1509 2.1842 1.6506 1.1714 1.0530 1.0670 1.1228 1.1452 1.3673 2.5260 1.1205 1.4440 1.3316 1.3820 1.2710 1.3594 7.7344 6.8650 1.2281 2.1591 2.1442 1.0945 1.1202 1.1656 1.6700 2.1995 1.0552 6.1753 5.8317 6.0004 6.0533 9.1289 1.0362 1.0600 1.0596 1.0955 1.0940 1.0974 1.1030 1.0871 1.1061 1.0863 1.0847 1.0882 1.0917 1.0927 1.0960 1.0967 1.1015 1.1017
irintensity: 0.0801 0.1815 1.3153 0.1516 0.2005 0.2182 1.7577 0.1950 1.8910 1.6016 2.7151 1.4885 0.7515 0.3009 0.7019 6.5058 7.1998 4.2790 2.0974 0.1439 0.0583 1.3310 3.4378 13.5107 29.8379 5.7917 4.0441 3.2233 0.5440 18.9396 14.7182 28.4131 48.6424 33.4368 80.1371 19.8041 4.6686 3.1861 2.5610 0.7183 4.9076 0.6487 2.5889 1.2184 6.1870 0.2985 0.4812 1.8094 0.1538 0.2943 1.5543 29.7425 24.1558 7.6658 91.3403 8.7708 5.9686 30.1933 37.7917 142.4536 10.8532 4.9323 0.1048 0.6373 1.3703 7.9538 36.2038 4.4767 3.3542 37.8676 1.4370 5.0663 2.1432 2.9900 0.1876 0.2551 24.9787 10.0910 8.2928 12.9513 8.7763 47.3995 28.0577 19.9946 13.9790 1.8159 39.2091 1.9991 6.1733 158.1234 17.0383 13.1777 29.6500 2.4392 3.5715 36.4228 0.9248 8.1844 25.2097 0.2350 0.9395 10.4025 20.5029 8.2239 29.9430 14.8260 24.4432 31.7913
temp: 298.150 k
press: 1.00000 atm
elementType: 16 8 8 6 6 6 6 6 6 6 6 6 6 6 6 6 6 6 6 6 1 1 1 1 1 1 1 1 1 1 1 1 1 1 1 1 1 1
symmnumber: 1
zpe: 798136.7 jmol-1
zpe.correction: 0.303994 hartree
zpe.thermalcorrener: 0.323581 hartree
zpe.thermalcorrenthalpy: 0.324525 hartree
zpe.thermalcorrgfe: 0.251887 hartree
zpe.sumelectzpe: -1205.669308 hartree
zpe.sumelectthermal: -1205.649722 hartree
zpe.sumelectthermalent: -1205.648778 hartree
zpe.sumelectthermalfe: -1205.721416 hartree
dipole: 0.8533 -0.1053 2.6851
dipole: 2.8193
quadrupole: -117.3236 -115.3169 -123.6510
quadrupole: -4.3226 -1.0900 5.2268
quadrupole: 1.4402 3.4470 -4.8872 -4.3226 -1.0900 5.2268
hfenergy: -1205.9733025 hartree
pointgroup: C01 [X(C17H18O2S1)]
dipole: -0.2719781 0.6608302 -0.8483443 debye
polarizability: 248.5439142|30.353797|175.3245386|33.5672118|8.2080733|190.8173895 unknown
InChI: InChI=1S/C17H18O2S/c1-2-19-17(18)16(13-14-9-5-3-6-10-14)20-15-11-7-4-8-12-15/h3-12,16H,2,13H2,1H3
charge 0 multiplicity 1
38 atoms
S  -1.501723 -1.193851 0.981697
O  -0.254259 2.004931 0.652514
O  0.876895 0.942539 2.397691
C  0.147354 -0.355892 0.426618
C  1.314934 -1.354873 0.600391
C  2.613636 -0.820547 0.002685
C  0.316088 0.895545 1.278917
C  2.882755 -0.986194 -1.381312
C  3.565285 -0.140124 0.805401
C  -2.601474 -0.872125 -0.464915
C  4.074295 -0.485676 -1.952009
C  4.759121 0.359829 0.237261
C  5.017647 0.189796 -1.142697
C  -3.444022 -1.929771 -0.885937
C  -2.661097 0.389542 -1.104476
C  -0.245932 3.285888 1.43185
C  -4.353565 -1.720014 -1.947695
C  -3.557297 0.580081 -2.181366
C  -4.409113 -0.467737 -2.602984
C  -1.434979 3.34056 2.394635
H  0.001199 -0.081405 -0.629673
H  1.022841 -2.297081 0.103322
H  1.44044 -1.564773 1.677543
H  2.159587 -1.519888 -2.011637
H  3.361952 -0.000294 1.873269
H  4.269867 -0.626585 -3.021201
H  5.487227 0.879156 0.870803
H  5.944827 0.575039 -1.582006
H  -3.381066 -2.907168 -0.395579
H  -2.025807 1.211947 -0.758537
H  0.714733 3.355144 1.971374
H  -0.301582 4.061334 0.651532
H  -5.005708 -2.539781 -2.26904
H  -3.59769 1.555228 -2.679876
H  -5.107489 -0.310686 -3.432282
H  -1.452986 4.320858 2.906177
H  -2.389223 3.214305 1.854742
H  -1.35347 2.553242 3.162299
