program: Gaussian 09
title: 000257568
version: EM64L-G09RevD.01
frameworkgroup: C1[X(C14H12ClN3O3S)]
method: RPBEPBE
basis: SDD
operation: Freq
keyword: #p
keyword: freq=noraman
keyword: PBEPBE/SDD
title: #p freq=noraman PBEPBE/SDD
converged: YES YES NO NO
title: Mulliken charges:
elementType: Cl S O O O N N N C C C C C C C C C C C C C C H H H H H H H H H H H H
charge: -0.021484 0.783850 -0.573725 -0.486766 -0.247293 -0.453332 -0.113701 0.002200 -0.207935 0.493149 -0.210209 -0.182255 -0.324466 -0.430257 0.348435 0.225082 -0.339180 -0.285026 -0.173455 -0.170838 -0.119942 -0.779698 0.296077 0.251507 0.316799 0.224840 0.304037 0.275394 0.326702 0.267279 0.267971 0.213045 0.261715 0.261480
chargesum: 0.00000
title: Mulliken charges with hydrogens summed into heavy atoms:
elementType: Cl S O O O N N N C C C C C C C C C C C C C C
charge: -0.021484 0.783850 -0.573725 -0.486766 -0.247293 -0.149295 -0.113701 0.002200 -0.207935 0.493149 0.085868 0.069251 -0.007667 -0.205417 0.348435 0.225082 -0.063786 0.041676 0.093824 0.097133 -0.119942 -0.043457
polarizability: 3.81144110e+02 -1.99393949e+01 2.19855710e+02 2.15113757e+01 -3.06904108e+00 1.57806100e+02
1716.lowfreq: -37.7151 -4.7640 -4.4308 0.0017 0.0017 0.0020 4.8369 8.9877 14.7453
frequency: -37.5849 8.5025 14.4076 18.1808 38.7942 53.9936 63.2397 74.1232 87.1581 107.9439 115.0186 145.4253 172.2308 202.8883 216.8218 256.6645 263.7333 292.4650 304.3353 321.9594 335.4978 370.6519 385.3066 409.0302 409.9862 412.6512 452.0522 454.8688 521.9559 526.9765 544.3873 570.0379 596.0234 600.7891 618.1664 621.6299 647.9842 675.5280 677.9140 705.1985 726.2981 793.5912 819.7949 821.4906 826.5891 843.8783 862.0039 885.5998 931.0503 943.2761 968.1467 983.5798 988.8118 994.4247 995.7642 1011.5156 1039.9260 1051.9751 1070.0745 1104.4593 1116.5154 1120.6036 1179.6467 1182.2962 1213.1252 1262.9431 1284.2575 1290.5682 1368.5624 1380.3415 1389.6796 1398.1559 1405.8670 1448.0205 1456.5936 1468.7448 1475.2838 1499.8170 1579.7085 1587.9245 1594.6011 1600.2754 1630.1280 1804.7370 2996.3450 3098.0914 3099.7183 3117.5282 3133.4613 3156.1183 3163.2336 3176.5976 3182.1225 3197.1436 3204.6473 3534.4382
redmass: 1.0694 6.8212 5.0017 6.0124 6.4233 11.5828 4.5161 5.1443 10.0646 8.2452 7.8675 8.5537 6.9690 5.7937 11.0385 8.7331 8.7363 11.3040 7.3829 6.5629 5.7108 6.0056 7.1883 2.9616 3.8137 5.3350 5.9841 5.2758 2.8198 8.4667 4.6421 4.9009 3.4795 8.4951 7.3379 7.1274 1.1861 6.7479 7.7550 4.0782 3.3074 7.7371 1.5111 4.5306 1.2722 1.4517 15.2477 1.3631 6.3422 1.3989 1.3412 1.3561 3.0507 2.0034 3.8775 1.3056 1.6374 2.4632 2.7829 1.3646 1.2978 2.8421 1.2271 1.1294 3.4077 1.9528 1.2433 1.3734 4.3074 5.9456 1.2264 4.1621 4.7392 1.0449 2.2605 1.1325 2.1602 2.2982 6.9382 7.6189 6.7746 5.6908 4.9250 13.8556 1.0364 1.1005 1.0979 1.0894 1.0908 1.0955 1.0893 1.0916 1.0977 1.0944 1.0963 1.0765
irintensity: 0.2200 1.7734 4.8525 0.6727 1.0622 0.6549 0.4194 5.3451 2.2429 4.7820 2.0096 3.1347 25.8416 14.6340 4.0955 2.2691 3.7145 59.0745 11.3151 42.8606 6.9236 19.2667 5.7194 0.1973 33.3601 44.6887 57.5769 33.5263 32.5357 279.2260 19.0527 23.1835 2.8090 47.4908 1.2919 2.0183 53.7653 24.7249 83.6087 2.4752 2.4103 241.2920 47.1606 0.5991 10.2221 53.5195 59.7658 57.4722 4.9807 1.4505 1.2307 3.2016 3.2894 22.9701 28.6668 0.5686 15.0338 24.8661 37.3446 45.3793 14.6135 91.1091 9.4760 24.4258 59.8168 72.0326 3.0099 32.8701 275.4682 1.2591 50.0431 16.1427 10.8158 15.2650 73.5199 18.2967 26.2140 508.7060 68.2278 21.9109 69.2019 56.7337 124.6261 227.3598 12.5878 19.0786 6.1378 18.0937 9.9063 6.2792 0.0369 0.6658 1.3202 6.3235 7.5151 13.1033
temp: 298.150 k
press: 1.00000 atm
elementType: 17 16 8 8 8 7 7 7 6 6 6 6 6 6 6 6 6 6 6 6 6 6 1 1 1 1 1 1 1 1 1 1 1 1
symmnumber: 1
zpe: 620590.4 jmol-1
zpe.correction: 0.236370 hartree
zpe.thermalcorrener: 0.257534 hartree
zpe.thermalcorrenthalpy: 0.258478 hartree
zpe.thermalcorrgfe: 0.180789 hartree
zpe.sumelectzpe: -1787.010475 hartree
zpe.sumelectthermal: -1786.989312 hartree
zpe.sumelectthermalent: -1786.988367 hartree
zpe.sumelectthermalfe: -1787.066057 hartree
dipole: 0.3433 4.4498 6.4085
dipole: 7.8095
quadrupole: -115.5252 -149.0283 -142.1059
quadrupole: -14.0455 -19.3993 -2.2500
quadrupole: 20.0279 -13.4752 -6.5528 -14.0455 -19.3993 -2.2500
hfenergy: -1787.2468456 hartree
pointgroup: C01 [X(C14H12Cl1N3O3S1)]
dipole: -0.0180064 -2.9427815 -0.8831216 debye
polarizability: 382.9991496|17.9393622|162.6954536|-15.6692975|16.4365258|213.1113162 unknown
InChI: InChI=1S/C8H8NO3S.C6H4ClN2/c1-6(10)9-7-2-4-8(5-3-7)13(11)12;7-5-1-3-6(9-8)4-2-5/h2-5,9H,1H3;1-4H
charge 0 multiplicity 1
34 atoms
Cl -6.429617 -0.729256 -3.174496
S  -0.095074 0.875117 2.302676
O  -0.005968 2.509798 2.184779
O  -1.181653 0.229165 0.92443
O  5.98367 1.007614 -1.287318
N  4.942623 -0.989552 -0.617924
N  -3.022853 0.025678 2.799202
N  -2.816085 0.028679 1.619615
C  1.440501 0.279667 1.369908
C  3.776043 -0.511476 0.040584
C  2.299429 1.261269 0.85113
C  1.713139 -1.095556 1.243262
C  3.476425 0.87245 0.179198
C  2.88885 -1.488224 0.577125
C  -3.647625 -0.148431 0.437057
C  5.96461 -0.255647 -1.23317
C  -4.990957 -0.547707 0.655002
C  -3.14128 0.079732 -0.861915
C  -5.841977 -0.726795 -0.451754
C  -3.998529 -0.098148 -1.967215
C  -5.331567 -0.499732 -1.747918
C  7.076139 -1.105684 -1.845117
H  2.034208 2.317948 0.978995
H  1.025419 -1.848595 1.640903
H  4.161926 1.612453 -0.23635
H  3.116718 -2.556215 0.467504
H  5.044292 -2.006472 -0.642945
H  -5.356101 -0.711766 1.67307
H  -2.103459 0.394347 -0.979345
H  -6.881379 -1.035167 -0.31059
H  -3.632481 0.076448 -2.982266
H  6.928008 -2.19381 -1.73217
H  8.036479 -0.827709 -1.377746
H  7.156923 -0.867523 -2.919598
