program: Gaussian 09
title: 000257565
version: EM64L-G09RevD.01
frameworkgroup: C1[X(C9H8Cl3NO3S2)]
method: RPBEPBE
basis: SDD
operation: Freq
keyword: #p
keyword: freq=noraman
keyword: PBEPBE/SDD
title: #p freq=noraman PBEPBE/SDD
converged: YES YES NO NO
title: Mulliken charges:
elementType: Cl Cl Cl S S O O O N C C C C C C C C C H H H H H H H H
charge: 0.124479 0.147722 0.083263 0.872765 0.224715 -0.470601 -0.477871 -0.239159 -0.444936 -0.150488 0.511737 -0.205796 -0.177864 -0.316924 -0.425020 0.228897 -0.718777 -0.794166 0.285990 0.295573 0.325051 0.238662 0.320209 0.242784 0.276393 0.243362
chargesum: 0.00000
title: Mulliken charges with hydrogens summed into heavy atoms:
elementType: Cl Cl Cl S S O O O N C C C C C C C C C
charge: 0.124479 0.147722 0.083263 0.872765 0.224715 -0.470601 -0.477871 -0.239159 -0.124727 -0.150488 0.511737 0.080194 0.117710 0.008126 -0.186358 0.228897 -0.718777 -0.031626
polarizability: 3.54897999e+02 3.76302841e+00 1.79915659e+02 -6.91944820e+00 -6.31941372e+00 1.65056943e+02
1716.lowfreq: -67.5528 -2.9131 0.0009 0.0013 0.0019 4.6361 7.7713 11.4059 20.3206
frequency: -67.5504 11.2055 20.3146 40.2941 47.7837 61.9070 73.3367 80.9844 98.0557 136.4350 152.4447 155.8987 175.3055 200.2955 210.5244 226.7562 280.7786 282.1689 293.1822 302.2991 321.6710 338.6230 376.5167 396.1383 406.1145 414.5689 435.6057 522.4131 552.9194 582.5178 603.2987 614.7136 630.7729 657.3278 672.7241 719.0866 721.8920 804.0202 816.1713 826.9619 860.7615 927.4307 944.0250 959.8215 974.8519 986.1050 1000.0296 1034.5348 1046.8699 1124.1388 1185.9084 1215.4485 1267.7712 1296.5466 1368.6946 1381.0175 1411.7067 1446.1877 1467.0693 1472.5821 1501.7333 1587.6215 1594.4933 1642.9072 2990.4049 3075.2760 3131.0581 3140.2402 3162.0728 3174.3111 3197.4709 3519.1174
redmass: 1.0387 13.9291 14.0670 4.9612 13.7194 17.7985 6.9988 4.5976 7.5691 15.9422 6.7211 14.0652 7.1515 26.4764 7.2762 27.6692 17.2677 28.5293 14.9998 7.5755 10.2284 6.2136 5.4489 13.7962 12.3112 2.9821 8.8936 2.9011 4.7646 2.8884 12.8958 6.9968 13.0487 1.1992 6.1211 10.7748 3.3979 15.0275 4.8022 1.3705 1.4773 6.5409 17.1324 1.3713 3.7593 1.9502 1.3280 1.6738 2.3739 1.3035 1.1262 3.2704 1.9281 1.4152 3.8187 1.2402 5.0340 1.1374 1.0465 2.2748 2.0715 6.3719 5.3341 5.2316 1.0387 1.0983 1.0905 1.0979 1.0914 1.0953 1.0954 1.0767
irintensity: 0.0719 0.5274 0.0978 4.9221 1.6694 0.3804 0.4199 4.8900 2.9668 5.6418 2.6914 0.1571 6.4521 0.0629 5.0720 1.3477 37.5285 1.5434 3.7405 4.2073 7.3101 34.3930 2.3760 61.6540 4.6503 0.0900 105.1626 65.3257 62.8490 1.8545 110.0084 4.6435 154.7372 68.2335 1.0860 263.5432 12.0198 77.6061 6.6763 26.6187 65.3852 4.8117 42.1694 3.2675 30.9345 21.2325 5.6074 8.2507 55.7593 13.4238 62.9741 116.5051 68.3221 79.4839 280.7017 77.0754 23.5189 43.8968 21.7822 45.7632 467.4776 135.2064 67.9467 114.4395 4.9259 11.1239 10.8472 5.5323 5.1934 6.0839 17.6567 22.0764
temp: 298.150 k
press: 1.00000 atm
elementType: 17 17 17 16 16 8 8 8 7 6 6 6 6 6 6 6 6 6 1 1 1 1 1 1 1 1
symmnumber: 1
zpe: 414818.5 jmol-1
zpe.correction: 0.157996 hartree
zpe.thermalcorrener: 0.177856 hartree
zpe.thermalcorrenthalpy: 0.178801 hartree
zpe.thermalcorrgfe: 0.105263 hartree
zpe.sumelectzpe: -2802.983422 hartree
zpe.sumelectthermal: -2802.963562 hartree
zpe.sumelectthermalent: -2802.962618 hartree
zpe.sumelectthermalfe: -2803.036155 hartree
dipole: -7.3314 -4.5510 2.9960
dipole: 9.1344
quadrupole: -125.2623 -148.9836 -140.7990
quadrupole: 10.9698 -19.3391 -5.0372
quadrupole: 13.0860 -10.6353 -2.4507 10.9698 -19.3391 -5.0372
hfenergy: -2803.1414181 hartree
pointgroup: C01 [X(C9H8Cl3N1O3S2)]
dipole: -3.0209939 1.1915329 1.5390883 debye
dipolederiv: -0.4829902 0.2282122 -0.3443324 0.0355337 -0.2878971 0.1084564 -0.5852085 0.3629415 -0.6467324 -0.6504238 -0.2743351 0.0932078 -0.5111346 -0.3474754 0.0216789 0.145898 0.1167991 -0.1977644 -0.4282582 0.220024 0.3145754 0.0862362 -0.3393908 -0.3553892 0.08443 -0.1608126 -0.4498193 2.2374384 -0.1751195 0.1757974 -0.5909345 0.9166462 -0.4287221 0.1471847 -0.1703462 1.4448677 -0.5197001 -0.0682728 -0.1244067 -0.0651872 -0.2246215 -0.1146899 -0.2531463 -0.0876487 -0.3910218 -0.6322004 0.0260657 0.0096501 0.0923876 -0.5500223 0.2670527 0.0423545 0.034611 -0.4367616 -0.699585 0.0431833 -0.0943751 0.085195 -0.3634297 -0.1109991 -0.0514863 0.0279353 -0.7176809 -0.7924686 -0.0008917 0.0943305 -0.5828551 -0.7545492 -0.1439097 -0.1985667 -0.2600559 -0.4355994 -2.5042253 -0.2563997 0.2652684 -0.4840964 -0.4000853 0.071657 0.3693046 0.0429653 -0.3604876 -0.4074681 -0.0131076 0.088787 -0.0682958 -0.1259171 0.0630102 0.2821809 0.0152015 -0.2829921 1.6745997 0.0230726 -0.3032836 -0.2430878 0.0974005 0.0404255 -0.661926 -0.0277426 0.2526826 0.2140859 -0.0199121 -0.1206707 0.4688485 -0.0296153 0.027264 -0.0309417 0.0654711 -0.0047791 0.0755442 0.0747542 -0.0422406 -0.2478393 0.0016964 0.0477121 -0.3776955 0.0394368 0.0081116 -0.4809898 0.0893923 0.0839124 0.2801455 -0.0800431 -0.0428254 0.308688 -0.0009689 -0.1783913 -0.6186155 -0.0496871 0.0112565 -0.2933985 -0.0100994 0.1441069 0.0095038 0.1207876 -0.0820363 2.1689403 0.2604283 -0.3087221 1.157067 0.9695856 0.2254717 0.0128584 0.386085 0.4179359 1.511009 -0.0741724 -0.0408633 0.7719146 0.9867395 0.5194919 0.3204342 -0.1668624 1.3201032 -0.4114997 0.067625 0.1644641 0.1890444 -0.0515308 -0.1107244 0.2913237 -0.0816933 -0.074725 0.1372517 0.0316396 0.0585019 0.0285251 0.0872598 -0.0185603 0.0001488 -0.0426295 0.101678 0.1021218 -0.0717192 0.0002884 -0.0360985 0.1105543 -0.0238082 -0.0238575 -0.0084422 0.1048364 0.1832718 -0.0389482 -0.0201339 0.0024486 0.1134965 -0.0341164 0.0726298 -0.0333704 0.1624323 0.0147851 0.0570105 0.0577616 0.0241293 0.0236395 -0.0897414 0.1157711 -0.1119305 0.0866157 0.1937651 -0.0464294 0.0165441 -0.0541406 0.1557168 -0.08143 0.0168521 -0.0738646 0.2418112 0.0415554 0.0023989 -0.0679156 0.0068128 0.1180342 -0.0289956 -0.0083602 -0.0278042 -0.0805514 0.0067688 -0.0521317 0.0090398 -0.1167775 0.0401039 -0.0195188 -0.023836 -0.0382668 0.1197462 0.0672875 0.0173202 0.0235588 0.0655573 -0.0561963 0.0671031 -0.004538 0.0802046 0.0785221 unknown
polarizability: 354.1319709|-8.7012972|165.1123837|11.3883754|5.5573646|180.6262469 unknown
InChI: InChI=1S/C8H8NO3S.CCl3S/c1-6(10)9-7-2-4-8(5-3-7)13(11)12;2-1(3,4)5/h2-5,9H,1H3;
charge 0 multiplicity 1
26 atoms
Cl 4.689001 -1.368267 2.559601
Cl 5.061886 0.880001 0.543745
Cl 2.536605 0.752199 2.198819
S  1.840575 0.068415 -1.599643
S  3.087648 -1.457596 0.081642
O  2.490376 1.56046 -1.580467
O  1.827179 -0.864555 -2.932315
O  -4.873995 -1.448815 -0.220931
N  -3.805952 0.484674 0.57771
C  0.099809 0.171926 -0.924972
C  -2.502688 0.337706 0.048176
C  -0.799543 -0.860902 -1.24011
C  -0.239945 1.285134 -0.135964
C  -2.118149 -0.775832 -0.754607
C  -1.557602 1.36327 0.343563
C  -4.914169 -0.373418 0.43721
C  3.818864 -0.289124 1.282705
C  -6.165499 0.122459 1.155217
H  -0.490516 -1.700935 -1.869909
H  0.493572 2.066709 0.080664
H  -2.851562 -1.550031 -0.984581
H  -1.853648 2.225339 0.953313
H  -3.963128 1.32683 1.137706
H  -5.989597 0.231906 2.241408
H  -6.971491 -0.608393 1.000537
H  -6.494129 1.101339 0.759484
