program: Gaussian 09
title: 000257561
version: EM64L-G09RevD.01
frameworkgroup: C1[X(C10H12BrNO3S)]
method: RPBEPBE
basis: SDD
operation: Freq
keyword: #p
keyword: freq=noraman
keyword: PBEPBE/SDD
title: #p freq=noraman PBEPBE/SDD
converged: YES YES NO NO
title: Mulliken charges:
elementType: Br S O O O N C C C C C C C C C C H H H H H H H H H H H H
charge: 0.004271 0.885258 -0.551764 -0.546140 -0.244418 -0.455300 -0.078952 -0.501042 -0.249178 -0.234906 -0.623359 0.498885 -0.319075 -0.422981 0.231802 -0.777384 0.285713 0.283580 0.286220 0.291208 0.313485 0.314170 0.322339 0.233820 0.309238 0.264984 0.264070 0.215453
chargesum: 0.00000
title: Mulliken charges with hydrogens summed into heavy atoms:
elementType: Br S O O O N C C C C C C C C C C
charge: 0.004271 0.885258 -0.551764 -0.546140 -0.244418 -0.146062 -0.078952 0.068251 0.037042 0.056303 0.004296 0.498885 0.003265 -0.189161 0.231802 -0.032877
polarizability: 2.78784844e+02 9.74357649e+00 1.27849754e+02 1.06876090e+00 -8.51327431e+00 1.40439790e+02
1716.lowfreq: -12.5907 -4.8421 -0.0018 0.0008 0.0008 1.7376 8.7753 21.5507 34.0159
frequency: 1.0478 21.4978 34.0015 35.4809 67.9805 68.5751 76.2913 98.1351 130.9393 148.0965 171.7403 198.0290 212.1922 232.7862 309.3864 313.8526 348.9061 376.7483 383.5512 413.5433 448.7258 511.4048 539.8536 565.5069 596.9631 618.3438 623.0214 651.3850 676.2813 725.3261 777.5051 790.7243 823.4601 836.4392 869.4618 886.5788 930.0583 959.4292 962.5654 987.0313 994.4819 998.9636 1040.8156 1054.4252 1062.0057 1085.6738 1119.7341 1181.7206 1201.7357 1213.7311 1261.0182 1261.7497 1264.4464 1293.3783 1368.5580 1391.4644 1405.3987 1410.3409 1448.4717 1461.8285 1468.8302 1474.8430 1500.6064 1593.8721 1599.6146 1632.8683 2998.0320 3062.6538 3073.8291 3100.1991 3100.7312 3124.2333 3149.9776 3152.4702 3158.8741 3170.9298 3196.3067 3533.3307
redmass: 4.0593 5.9423 1.2100 3.1479 4.2152 3.8273 4.5472 6.6944 11.2969 5.8455 7.4803 5.6512 6.0561 4.1277 7.4200 7.3342 5.1700 5.0918 5.9672 2.9777 8.4185 3.2299 4.4918 5.7635 3.1048 6.6789 5.3949 1.1969 6.2831 3.3762 1.1542 15.6191 4.8287 1.4100 1.4441 2.3831 5.8549 2.2141 1.3809 4.0656 1.7219 1.3336 1.6417 2.4454 4.4893 1.0758 1.3046 1.1264 1.1508 3.3781 1.1823 1.2217 1.8645 1.4077 4.1005 1.2282 4.7404 1.1106 1.0448 1.0995 1.1710 2.0271 2.2873 6.8584 5.7285 4.9328 1.0364 1.0568 1.0550 1.1007 1.0979 1.0900 1.1114 1.0913 1.0955 1.1124 1.0951 1.0767
irintensity: 1.3890 0.5615 0.1221 5.0360 6.4778 1.6517 5.6248 1.9148 6.5677 7.2898 4.2397 0.3415 16.0274 1.2169 2.8092 13.1047 19.4842 0.3705 32.0239 0.0037 78.4076 21.6546 28.1337 95.1986 2.3347 4.8080 10.1334 57.3283 2.9078 1.6595 3.2252 91.7533 8.3529 28.8806 45.6384 48.9492 2.7659 28.6446 2.4584 4.0027 16.3551 3.3788 15.5935 55.3688 26.6355 9.6723 9.5988 37.4321 18.9141 69.1716 11.3374 3.0420 62.6580 56.1480 262.3982 49.7677 14.0442 8.3818 16.1379 9.8191 15.3074 30.3234 460.8634 102.0219 33.4771 111.0675 9.8382 4.9033 4.8916 17.5220 4.9471 13.4877 0.1295 2.2745 8.7718 0.1609 10.6176 15.9470
temp: 298.150 k
press: 1.00000 atm
elementType: 35 16 8 8 8 7 6 6 6 6 6 6 6 6 6 6 1 1 1 1 1 1 1 1 1 1 1 1
symmnumber: 1
zpe: 538528.8 jmol-1
zpe.correction: 0.205115 hartree
zpe.thermalcorrener: 0.222965 hartree
zpe.thermalcorrenthalpy: 0.223909 hartree
zpe.thermalcorrgfe: 0.151634 hartree
zpe.sumelectzpe: -1078.867251 hartree
zpe.sumelectthermal: -1078.849401 hartree
zpe.sumelectthermalent: -1078.848457 hartree
zpe.sumelectthermalfe: -1078.920732 hartree
dipole: -5.7272 -3.0037 -4.7406
dipole: 8.0185
quadrupole: -93.3565 -127.5485 -112.9116
quadrupole: -3.3956 20.6395 -0.3575
quadrupole: 17.9157 -16.2763 -1.6394 -3.3956 20.6395 -0.3575
hfenergy: -1079.0723659 hartree
pointgroup: C01 [X(C10H12Br1N1O3S1)]
dipole: -2.4106023 0.2340373 2.0214852 debye
polarizability: 278.2856463|12.2499864|134.3381388|4.5488924|-10.4614549|134.4506039 unknown
InChI: InChI=1S/C10H12BrNO3S/c1-8(13)12-9-2-4-10(5-3-9)16(14,15)7-6-11/h2-5,12H,6-7H2,1H3
charge 0 multiplicity 1
28 atoms
Br 5.788502 2.28251 0.96624
S  2.506929 -0.741673 -0.487778
O  3.027828 -2.052174 0.348299
O  2.746005 -0.579206 -2.099641
O  -4.250932 1.170492 -1.072635
N  -3.44235 -0.167379 0.680291
C  0.668756 -0.520742 -0.131024
C  3.373407 0.818754 0.352735
C  -0.113218 0.207324 -1.041812
C  0.137808 -1.151526 1.006859
C  4.860673 0.694836 0.098055
C  -2.062301 -0.261437 0.362969
C  -1.494188 0.346537 -0.793133
C  -1.240548 -1.013967 1.251145
C  -4.45549 0.513467 -0.012742
C  -5.840736 0.400925 0.616171
H  2.904871 1.684061 -0.139594
H  3.092704 0.740207 1.413743
H  0.339504 0.634299 -1.943165
H  0.78057 -1.75274 1.658334
H  5.299375 -0.197024 0.568005
H  5.11568 0.751228 -0.969833
H  -2.13741 0.906961 -1.473171
H  -1.683085 -1.49795 2.130552
H  -3.733079 -0.662556 1.526279
H  -6.530745 -0.049103 -0.118105
H  -6.216824 1.414864 0.835637
H  -5.869305 -0.19729 1.543319
