program: Gaussian 09
title: 000257552
version: EM64L-G09RevD.01
frameworkgroup: C1[X(C10H11NO6S)]
method: RPBEPBE
basis: SDD
operation: Freq
keyword: #p
keyword: freq=noraman
keyword: PBEPBE/SDD
title: #p freq=noraman PBEPBE/SDD
converged: YES YES NO NO
title: Mulliken charges:
elementType: S O O O O O O N C C C C C C C C C C H H H H H H H H H H H
charge: 0.977361 -0.525375 -0.525717 -0.434735 -0.434567 -0.227577 -0.227603 -0.237161 -0.078513 -0.308968 -0.307677 0.273346 0.272769 -0.471462 -0.614075 -0.614354 0.116787 0.116883 0.328006 0.327228 0.317009 0.279104 0.254172 0.209737 0.279174 0.209889 0.254183 0.396062 0.396072
chargesum: 0.00000
title: Mulliken charges with hydrogens summed into heavy atoms:
elementType: S O O O O O O N C C C C C C C C C C
charge: 0.977361 -0.525375 -0.525717 -0.038673 -0.038495 -0.227577 -0.227603 -0.237161 -0.078513 0.019038 0.019551 0.273346 0.272769 -0.154453 0.128938 0.128893 0.116787 0.116883
polarizability: 2.06604120e+02 -1.43470484e-01 1.92225156e+02 3.96678647e-01 -1.39273700e-02 1.05361596e+02
1716.lowfreq: -7.3521 -0.0020 -0.0007 -0.0002 6.9668 7.1650 23.7874 46.9918 49.6558
frequency: 23.6621 46.9505 49.5403 55.2339 56.7196 91.3425 109.4130 122.4733 182.8967 185.2091 199.4266 210.7383 212.7482 217.6353 236.8177 242.7912 288.1043 295.5352 320.4312 373.8385 374.2170 417.4794 427.6264 443.7827 454.4768 484.0294 522.8067 542.2449 594.9363 599.6760 612.9696 617.1196 676.7530 730.4301 749.3426 752.3764 813.1798 846.8350 857.3836 949.2272 957.5516 966.2363 982.0550 993.1745 1015.9414 1019.8176 1064.3059 1080.0874 1087.0790 1107.6194 1118.2973 1174.7513 1175.5626 1208.1781 1254.2219 1303.4566 1330.4227 1391.1817 1406.0525 1417.8272 1426.5771 1441.1519 1455.3795 1462.2423 1470.5901 1475.9586 1562.7077 1613.4065 1644.2107 1654.9365 2918.4050 2921.5577 3042.0769 3043.6085 3098.2234 3099.8782 3164.9625 3170.1591 3171.9829 3534.6691 3534.8463
redmass: 5.0534 5.4395 2.9454 13.0191 6.3851 9.5393 6.3863 8.0592 3.6463 3.9101 3.4404 2.9063 2.9566 1.6270 1.6570 4.6576 7.8355 4.4009 8.2350 5.6586 3.5747 6.5916 9.7436 3.4098 4.7639 8.9397 4.5737 4.9109 4.9282 1.4457 3.9360 1.2555 3.0147 3.1987 7.8254 8.6882 16.5098 8.7352 4.3017 1.5716 8.2592 1.5327 5.8625 1.4636 1.4302 4.2568 2.3961 1.2277 1.6854 1.3700 1.3590 5.2486 2.1120 1.6794 1.2233 2.2740 2.6968 8.1335 1.1333 1.1500 3.9488 4.2170 1.0478 1.0512 1.0447 1.0557 7.0835 7.0612 9.4139 9.3323 1.0468 1.0463 1.0871 1.0857 1.0984 1.0997 1.0925 1.0920 1.0938 1.0644 1.0644
irintensity: 2.0248 4.7768 0.3328 0.0007 2.1203 2.6646 0.0096 1.5711 2.1808 0.0243 0.3889 0.2788 1.6065 0.0712 4.0366 3.5599 2.0166 4.9051 0.3125 3.8527 9.9639 12.8437 95.3340 0.0176 53.3288 3.2404 18.2284 44.7035 80.9606 293.9703 25.4000 1.0686 17.1638 72.6942 0.0349 3.3116 80.8919 27.4998 46.0243 10.8961 43.2205 1.7308 2.4605 11.5196 1.0895 22.0274 513.5078 0.3338 33.4810 20.1208 156.6445 12.7887 1.1581 15.5755 4.9677 167.5413 19.0493 0.0697 27.2424 2.0941 2.4810 0.2620 25.3971 2.6435 15.1063 48.1912 38.0334 35.5542 7.1077 480.5127 21.3922 92.4826 1.2689 38.8805 1.4191 1.8676 9.2427 12.7378 7.3493 118.9997 2.2066
temp: 298.150 k
press: 1.00000 atm
elementType: 16 8 8 8 8 8 8 7 6 6 6 6 6 6 6 6 6 6 1 1 1 1 1 1 1 1 1 1 1
symmnumber: 1
zpe: 532037.7 jmol-1
zpe.correction: 0.202642 hartree
zpe.thermalcorrener: 0.221679 hartree
zpe.thermalcorrenthalpy: 0.222623 hartree
zpe.thermalcorrgfe: 0.153904 hartree
zpe.sumelectzpe: -1290.315265 hartree
zpe.sumelectthermal: -1290.296229 hartree
zpe.sumelectthermalent: -1290.295285 hartree
zpe.sumelectthermalfe: -1290.364004 hartree
dipole: 0.4025 0.0522 4.7474
dipole: 4.7648
quadrupole: -138.4341 -92.9003 -114.2843
quadrupole: -0.3867 -18.9791 -0.0469
quadrupole: -23.2279 22.3059 0.9219 -0.3867 -18.9791 -0.0469
hfenergy: -1290.5179078 hartree
pointgroup: C01 [X(C10H11N1O6S1)]
dipole: 0.2050601 -0.0538585 -1.8625728 debye
polarizability: 206.5479188|-0.3815033|192.2168628|2.1932139|-1.2763532|105.4260907 unknown
InChI: InChI=1S/C10H11NO6S/c1-11(2)18(16,17)8-4-6(9(12)13)3-7(5-8)10(14)15/h3-5,12,14H,1-2H3
charge 0 multiplicity 1
29 atoms
S  -2.509957 0.112404 0.71489
O  -2.914906 -1.28936 1.428933
O  -2.793562 1.57655 1.358607
O  1.231323 -3.688211 0.135454
O  1.545895 3.554665 0.034167
O  3.329675 -2.729651 -0.15997
O  3.552498 2.410332 -0.236547
N  -3.419252 0.110124 -0.941393
C  -0.629785 0.025395 0.392166
C  0.077497 1.230775 0.280755
C  -0.029886 -1.239617 0.317905
C  1.477651 1.157831 0.062568
C  1.370964 -1.294537 0.098821
C  2.118482 -0.10014 -0.02978
C  -3.126747 1.335754 -1.718289
C  -3.234591 -1.173426 -1.655261
C  2.096622 -2.596256 0.009723
C  2.313039 2.38891 -0.062534
H  -0.424559 2.196826 0.390341
H  -0.612746 -2.155275 0.455766
H  3.200539 -0.149653 -0.190989
H  -3.186645 2.208694 -1.047426
H  -3.922727 1.437257 -2.47798
H  -2.142268 1.320316 -2.238195
H  -3.370192 -2.003242 -0.942105
H  -2.252643 -1.2696 -2.171305
H  -4.036455 -1.243036 -2.41236
H  1.7537 -4.533042 0.084594
H  2.139134 4.349516 -0.039856
