program: Gaussian 09
title: 000257550
version: EM64L-G09RevD.01
frameworkgroup: C1[X(C14H13NO4S2)]
method: RPBEPBE
basis: SDD
operation: Freq
keyword: #p
keyword: freq=noraman
keyword: PBEPBE/SDD
title: #p freq=noraman PBEPBE/SDD
converged: YES YES NO NO
title: Mulliken charges:
elementType: S S O O O O N C C C C C C C C C C C C C C H H H H H H H H H H H H H
charge: 0.845507 0.103129 -0.492754 -0.499296 -0.204081 -0.195726 0.007430 -0.113015 0.510402 -0.532491 -0.178050 -0.237755 -0.407937 -0.380874 -0.407575 -0.666595 0.499221 -0.156970 -0.324681 -0.214731 -0.198151 0.217122 0.215631 0.299007 0.290925 0.249576 0.247718 0.223795 0.223784 0.227747 0.274736 0.282458 0.246126 0.246368
chargesum: 0.00000
title: Mulliken charges with hydrogens summed into heavy atoms:
elementType: S S O O O O N C C C C C C C C C C C C C C
charge: 0.845507 0.103129 -0.492754 -0.499296 -0.204081 -0.195726 0.007430 -0.113015 0.510402 -0.099738 0.120957 0.053170 -0.158361 -0.133156 -0.407575 0.008731 0.499221 0.117766 -0.042223 0.031394 0.048217
polarizability: 3.96993903e+02 8.64690156e+00 2.22204106e+02 -2.40012993e+00 -1.54057651e+01 1.41526890e+02
1716.lowfreq: -18.5531 -5.9341 -0.0001 0.0013 0.0014 2.3126 7.1581 19.9889 24.8867
frequency: -16.9415 19.7059 24.6659 35.8239 47.7022 54.9175 90.5710 101.3237 115.2245 133.5104 155.0168 172.1735 184.0993 208.3521 210.6409 245.0880 254.5600 296.4675 302.3990 328.7366 348.9767 378.7642 387.8425 406.8197 413.8913 439.9825 444.4956 482.6813 526.6966 539.3629 587.2819 618.4005 633.7076 658.2876 698.8211 719.9652 732.2295 762.4097 780.7482 786.2675 792.9681 799.8824 836.0970 845.5908 891.3656 922.6813 962.6147 967.2180 974.8929 980.2080 986.3210 1002.9896 1023.4852 1033.7589 1044.0749 1047.9362 1060.7763 1101.9645 1124.9832 1134.7776 1174.5119 1187.7413 1211.6601 1214.2337 1240.7967 1255.4234 1302.8187 1309.2229 1363.6529 1375.5625 1386.6518 1390.1588 1399.7439 1423.8273 1436.8487 1464.5915 1471.9790 1477.3265 1490.3329 1560.9869 1582.0371 1586.6101 1587.9799 2984.0494 2994.5046 3046.4219 3084.7221 3088.2020 3134.9187 3139.6290 3147.2003 3161.9412 3165.8834 3175.3871 3183.8936 3186.0045
redmass: 2.6087 6.0190 5.3310 9.7771 7.0384 4.5721 7.2512 5.5722 5.4669 6.3308 15.2324 5.2823 8.7140 1.5825 3.7063 8.3863 7.3541 5.4700 4.4566 5.4276 10.7136 2.9321 12.3801 2.8811 4.2266 9.1235 9.2183 4.0571 3.2991 5.7892 4.0191 6.8757 7.0681 5.1506 8.4627 3.5705 3.2714 3.8475 1.4761 1.1611 8.7764 14.4516 1.3004 1.4303 1.3892 18.7505 1.3262 2.5128 1.3881 1.3872 5.2583 1.3685 6.7667 3.0182 2.3895 1.4473 2.0376 2.4301 1.2857 1.8431 1.0764 1.1254 8.3711 2.6126 1.2537 1.4483 1.2615 1.4912 10.6929 5.0105 6.7458 1.1965 2.7446 2.5356 2.3202 1.9107 1.0453 1.1557 1.0970 6.1164 6.1560 5.9607 7.3170 1.0347 1.0601 1.1020 1.1003 1.1014 1.0895 1.0907 1.0869 1.0914 1.0954 1.0960 1.0949 1.0986
irintensity: 0.0945 3.5332 2.8593 0.0461 1.3204 1.0237 1.2866 0.2868 1.1810 0.7142 0.3802 4.9251 2.9941 0.6481 1.0056 2.4929 5.5106 3.1715 0.0446 34.6826 4.5612 0.2264 18.6343 0.4742 1.1360 49.4552 96.5477 8.4985 29.8725 0.9126 27.6769 0.7677 3.2011 10.1422 7.5509 1.3778 13.5690 0.7192 50.2320 2.1499 12.6665 66.6755 12.6958 38.2126 1.2797 43.8168 1.4051 10.9414 3.5192 1.1285 3.4765 0.5819 1.8793 0.0391 32.4844 2.6097 28.3548 24.5200 6.1145 1.3484 1.9090 30.3720 172.5933 25.5949 0.0438 2.2793 0.5072 1.7947 152.5376 3.8480 5.6192 9.0720 10.7507 9.5492 29.8042 17.1116 16.3440 11.9644 12.8771 7.8895 8.0667 15.5039 1.0740 36.0861 36.7310 5.3244 58.2623 36.2916 12.5965 9.1391 2.9869 8.4339 8.1526 6.5922 12.5253 10.3326
temp: 298.150 k
press: 1.00000 atm
elementType: 16 16 8 8 8 8 7 6 6 6 6 6 6 6 6 6 6 6 6 6 6 1 1 1 1 1 1 1 1 1 1 1 1 1
symmnumber: 1
zpe: 635520.0 jmol-1
zpe.correction: 0.242057 hartree
zpe.thermalcorrener: 0.262219 hartree
zpe.thermalcorrenthalpy: 0.263164 hartree
zpe.thermalcorrgfe: 0.190693 hartree
zpe.sumelectzpe: -1691.301873 hartree
zpe.sumelectthermal: -1691.281710 hartree
zpe.sumelectthermalent: -1691.280766 hartree
zpe.sumelectthermalfe: -1691.353236 hartree
dipole: -0.8887 0.2076 0.8447
dipole: 1.2435
quadrupole: -82.9337 -149.4358 -142.5198
quadrupole: -6.1868 -2.3721 -7.9518
quadrupole: 42.0294 -24.4727 -17.5567 -6.1868 -2.3721 -7.9518
hfenergy: -1691.5439294 hartree
pointgroup: C01 [X(C14H13N1O4S2)]
dipole: -0.3512479 -0.0072451 -0.3404909 debye
polarizability: 397.4395993|1.3405945|223.764402|-1.6545294|8.382296|139.5208982 unknown
InChI: InChI=1S/C8H9O2S.C6H4NO2S/c1-2-7-3-5-8(6-4-7)11(9)10;8-7(9)5-3-1-2-4-6(5)10/h3-6H,2H2,1H3;1-4H
charge 0 multiplicity 1
34 atoms
S  -0.230246 1.590162 0.772839
S  1.009474 1.558986 -1.471503
O  0.646564 0.640036 1.768427
O  -0.466508 3.162288 1.14373
O  2.428502 -2.686244 -1.021277
O  0.661097 -1.29247 -0.67937
N  1.926205 -1.525376 -0.746312
C  -1.930104 0.828708 0.476292
C  -4.486721 -0.239217 0.112424
C  -5.869754 -0.822027 -0.131268
C  -2.068025 -0.567766 0.493408
C  -2.998002 1.721593 0.281428
C  -3.367604 -1.089719 0.315104
C  -4.283167 1.166485 0.102306
C  2.553593 0.953068 -0.760352
C  -6.153061 -1.033515 -1.644288
C  2.877115 -0.414993 -0.499387
C  3.56674 1.920863 -0.503005
C  4.148319 -0.793982 -0.015414
C  4.833392 1.551173 -0.00894
C  5.124149 0.189088 0.239825
H  -5.967318 -1.791401 0.392356
H  -6.641363 -0.149544 0.288897
H  -1.204469 -1.220468 0.641358
H  -2.831759 2.803141 0.298692
H  -3.509096 -2.176417 0.330319
H  -5.138795 1.836834 -0.039925
H  -6.092923 -0.077987 -2.195767
H  -7.162743 -1.45586 -1.795723
H  -5.418292 -1.726719 -2.091458
H  3.329776 2.971575 -0.694337
H  4.347896 -1.855176 0.154944
H  5.584933 2.322074 0.188818
H  6.102097 -0.106092 0.632958
