program: Gaussian 09
title: 000257549
version: EM64L-G09RevD.01
frameworkgroup: C1[X(C12H8ClNO4S2)]
method: RPBEPBE
basis: SDD
operation: Freq
keyword: #p
keyword: freq=noraman
keyword: PBEPBE/SDD
title: #p freq=noraman PBEPBE/SDD
converged: YES YES NO NO
title: Mulliken charges:
elementType: Cl S S O O O O N C C C C C C C C C C C C H H H H H H H H
charge: -0.023825 0.847319 0.111900 -0.489340 -0.496389 -0.198789 -0.199210 0.008646 -0.108368 -0.408444 -0.158126 -0.214958 0.500377 -0.154993 -0.206873 -0.184899 -0.323098 -0.095901 -0.213487 -0.196190 0.306522 0.298132 0.275756 0.272701 0.271057 0.283925 0.248174 0.248382
chargesum: 0.00000
title: Mulliken charges with hydrogens summed into heavy atoms:
elementType: Cl S S O O O O N C C C C C C C C C C C C
charge: -0.023825 0.847319 0.111900 -0.489340 -0.496389 -0.198789 -0.199210 0.008646 -0.108368 -0.408444 0.148396 0.083174 0.500377 0.120763 0.065828 0.086157 -0.039174 -0.095901 0.034688 0.052192
polarizability: 3.89953197e+02 5.11207805e+00 2.10452928e+02 -8.98381727e+00 -1.25106715e+01 1.21353688e+02
1716.lowfreq: -10.1790 -4.2623 -1.0182 -0.0028 -0.0027 0.0006 15.4017 21.8897 35.3356
frequency: 13.7715 21.6411 35.3174 47.7958 53.8239 92.3777 106.7901 115.4263 130.2604 155.5512 182.9938 204.2686 211.3529 244.2309 258.1511 274.0345 298.4011 347.7136 356.3330 371.6695 397.3638 408.8772 414.1773 440.8162 476.9374 486.2795 502.8695 539.4626 609.1650 633.6250 658.1111 691.6742 698.9308 702.2654 732.7027 781.3229 793.1544 798.6283 818.0322 829.8936 893.3224 922.5882 951.3261 968.8936 974.4987 976.4954 1004.0820 1023.1360 1033.8366 1039.9884 1067.3767 1102.1489 1109.2605 1134.9478 1175.0761 1180.5395 1212.9774 1255.7495 1285.9384 1364.6837 1376.4494 1379.8181 1381.6773 1424.3500 1436.7942 1447.6995 1560.9163 1562.3812 1581.3516 1588.4922 3149.0864 3161.7494 3162.9208 3172.4442 3176.1332 3181.4431 3186.2572 3189.0948
redmass: 6.9123 7.8853 12.8171 7.9269 6.7570 9.3698 7.0834 7.3126 11.2944 15.9260 8.9073 13.4586 13.3355 10.7049 9.9207 8.4766 7.3004 11.6279 5.9355 15.0304 10.5597 2.9202 4.2385 9.6960 5.3259 5.5179 3.8888 5.7797 7.1319 7.0626 5.1558 4.7205 8.0575 5.9484 3.3353 1.4680 8.7063 13.9317 1.2854 1.3921 1.3864 18.9396 1.3407 1.4072 6.2351 1.3906 1.3708 6.7361 3.0193 2.7200 3.1333 2.4053 1.3356 1.8462 1.0763 1.1334 10.5562 1.4497 1.2330 10.7057 5.0118 3.7424 5.9030 2.5441 2.3167 2.0637 6.0830 6.0843 6.1561 8.1310 1.0869 1.0895 1.0913 1.0896 1.0959 1.0969 1.0990 1.0977
irintensity: 1.8276 2.2936 0.1491 2.7486 0.2565 2.8651 0.6411 3.2368 1.1191 0.3366 1.7100 4.5503 3.9794 0.9805 0.1798 8.7224 1.2624 18.6038 7.6846 37.2073 86.0308 2.3890 1.2110 1.3116 6.5093 8.8138 96.3039 0.9651 0.5784 3.1670 9.8872 11.6493 13.8841 21.1334 12.9157 49.8724 14.0516 65.8791 12.3536 52.5038 1.3465 42.9784 0.1553 0.6908 52.4373 3.7408 0.6625 1.2841 0.0489 39.9442 76.0425 27.7498 7.1889 1.3372 1.7369 22.6349 193.0402 2.6276 0.8298 156.3647 3.7518 20.5855 1.3853 10.2650 27.7851 68.9312 7.8608 40.7606 10.8025 2.0805 2.6767 4.3320 6.9850 3.3444 5.6180 1.6106 11.0772 12.6538
temp: 298.150 k
press: 1.00000 atm
elementType: 17 16 16 8 8 8 8 7 6 6 6 6 6 6 6 6 6 6 6 6 1 1 1 1 1 1 1 1
symmnumber: 1
zpe: 464941.3 jmol-1
zpe.correction: 0.177087 hartree
zpe.thermalcorrener: 0.196316 hartree
zpe.thermalcorrenthalpy: 0.197260 hartree
zpe.thermalcorrgfe: 0.125862 hartree
zpe.sumelectzpe: -2072.236419 hartree
zpe.sumelectthermal: -2072.217190 hartree
zpe.sumelectthermalent: -2072.216246 hartree
zpe.sumelectthermalfe: -2072.287644 hartree
dipole: 2.3307 -0.7453 0.5129
dipole: 2.5002
quadrupole: -102.3133 -146.0836 -141.8087
quadrupole: -1.3689 -3.7612 -8.7628
quadrupole: 27.7552 -16.0151 -11.7401 -1.3689 -3.7612 -8.7628
hfenergy: -2072.4135062 hartree
pointgroup: C01 [X(C12H8Cl1N1O4S2)]
dipole: -0.8643869 0.4436468 0.1534668 debye
polarizability: 388.8074766|-16.6298747|213.1636757|3.3248071|-6.0341938|119.788661 unknown
InChI: InChI=1S/C6H4ClO2S.C6H4NO2S/c7-5-1-3-6(4-2-5)10(8)9;8-7(9)5-3-1-2-4-6(5)10/h2*1-4H
charge 0 multiplicity 1
28 atoms
Cl 6.23316 -1.565799 0.421373
S  0.613016 1.407193 -0.673876
S  -0.720123 1.45276 1.51138
O  -0.281595 0.534687 -1.722823
O  1.00253 2.955487 -1.013921
O  -2.412929 -2.674108 0.965708
O  -0.542624 -1.404526 0.695909
N  -1.82269 -1.550125 0.718792
C  2.234524 0.508504 -0.320109
C  -2.273025 0.966201 0.732104
C  2.262314 -0.89524 -0.351203
C  3.359166 1.313902 -0.068408
C  -2.68393 -0.373771 0.448869
C  -3.201554 2.006945 0.442485
C  3.503498 -1.531151 -0.127299
C  4.59496 0.669188 0.158556
C  -3.959518 -0.65738 -0.084798
C  4.643295 -0.740168 0.127207
C  -4.472007 1.732111 -0.10159
C  -4.851068 0.39575 -0.369588
H  1.357528 -1.477998 -0.539081
H  3.279537 2.405238 -0.074539
H  -2.896467 3.036854 0.649773
H  3.57435 -2.621894 -0.143037
H  5.498453 1.253703 0.351451
H  -4.229198 -1.700343 -0.270697
H  -5.157486 2.556286 -0.322577
H  -5.832214 0.174098 -0.80106
