program: Gaussian 09
title: 000257544
version: EM64L-G09RevD.01
frameworkgroup: C1[X(C14H8Cl6O6S5)]
method: RPBEPBE
basis: SDD
operation: Freq
keyword: #p
keyword: freq=noraman
keyword: PBEPBE/SDD
title: #p freq=noraman PBEPBE/SDD
converged: YES YES NO NO
title: Mulliken charges:
elementType: Cl Cl Cl Cl Cl Cl S S S S S O O O O O O C C C C C C C C C C C C C C H H H H H H H H
charge: 0.092155 0.137579 0.165389 0.109749 0.146803 0.170719 0.872660 0.865852 0.864976 0.243061 0.224942 -0.497805 -0.515924 -0.459942 -0.464352 -0.468743 -0.450618 -0.028100 -0.028994 -0.239371 -0.247210 -0.091469 -0.082143 -0.240006 -0.228285 -0.197419 -0.219742 -0.186955 -0.179104 -0.724347 -0.720206 0.325393 0.334304 0.297021 0.293261 0.300996 0.300317 0.262736 0.262820
chargesum: 0.00000
title: Mulliken charges with hydrogens summed into heavy atoms:
elementType: Cl Cl Cl Cl Cl Cl S S S S S O O O O O O C C C C C C C C C C C C C C
charge: 0.092155 0.137579 0.165389 0.109749 0.146803 0.170719 0.872660 0.865852 0.864976 0.243061 0.224942 -0.497805 -0.515924 -0.459942 -0.464352 -0.468743 -0.450618 -0.028100 -0.028994 0.086022 0.087094 -0.091469 -0.082143 0.057015 0.064976 0.103577 0.080576 0.075781 0.083716 -0.724347 -0.720206
polarizability: 4.25062223e+02 -4.29727464e+01 4.24049795e+02 -1.11055313e+01 1.18516811e+00 3.03177235e+02
1716.lowfreq: -3.9821 -1.1454 -0.0018 0.0027 0.0027 3.5471 5.9658 10.6485 16.2470
frequency: 4.9263 10.0826 16.2239 18.4986 23.9493 24.3089 32.9436 40.2529 54.7030 56.8193 61.3005 64.9656 65.5103 77.8484 83.9325 133.9377 138.3576 141.1097 145.1769 152.7631 157.4163 162.8868 167.8888 181.2675 194.8748 199.3637 208.8123 213.8199 227.8819 229.0146 232.5685 251.5461 256.2912 269.1513 281.3886 281.7067 284.6292 286.1334 297.4515 304.0479 319.8076 366.4059 371.8576 373.2064 383.2021 396.6128 399.2543 408.8176 414.2501 420.8133 425.4771 454.0586 473.8765 549.0339 559.1076 600.0201 605.3772 623.1626 624.9102 637.3331 640.2227 675.7913 677.9814 683.5681 691.3835 716.6204 717.2785 789.3130 804.6040 807.7998 809.4142 812.9888 912.6588 921.6689 934.8160 942.9953 945.6152 947.3280 949.8504 962.1199 966.1104 1003.1447 1005.0853 1035.2167 1037.0685 1049.3063 1057.5276 1088.6980 1093.9457 1172.3072 1175.0259 1264.0119 1268.8006 1385.9019 1388.2511 1407.1427 1410.1276 1432.2754 1435.3536 1565.7690 1568.6410 1590.1034 1592.7847 3144.1043 3147.2763 3151.5932 3152.8491 3160.2314 3164.0840 3178.2668 3179.5449
redmass: 21.7836 15.3705 26.2338 17.2362 17.7324 26.1638 18.9165 11.1858 7.1879 12.3084 11.1424 22.2541 21.8541 14.4636 11.6015 9.6624 19.0022 12.2088 10.5500 13.3273 11.9787 8.8561 8.4350 7.6624 14.2784 22.6018 10.3392 10.3460 26.0550 22.9715 6.6243 6.9767 8.3981 10.6082 30.5337 30.6507 27.7116 26.8310 18.4507 22.6959 14.5749 6.7957 11.1759 12.6520 8.7364 18.0114 20.6257 11.1286 14.1934 4.6724 6.5546 4.0924 7.4155 6.5190 6.4304 13.0544 12.9028 7.2224 7.2915 12.5524 12.8334 2.5339 3.3360 4.9667 8.8261 13.1775 13.1878 11.6825 13.0308 8.5653 1.4778 1.3886 1.4140 1.4566 9.2889 10.7107 8.5715 1.5418 1.4334 6.9817 6.1560 1.3733 1.3726 6.5902 6.4680 1.6787 1.7572 1.5517 1.5686 1.0907 1.0916 1.2812 1.2710 8.1840 8.0203 2.5444 2.5532 2.1471 2.1542 6.6221 6.5273 7.6766 7.7084 1.0931 1.0929 1.0889 1.0884 1.0923 1.0919 1.0994 1.0993
irintensity: 0.1879 0.9292 0.1159 0.2863 0.1773 0.0749 0.1951 0.9485 1.7105 0.1635 0.2162 0.5345 0.5696 5.4687 1.2152 1.5737 3.6553 1.8525 1.5856 2.3896 0.6530 6.2680 2.1643 0.6286 1.0239 0.4753 2.4233 1.8742 0.8869 1.9807 1.8203 11.5826 19.4307 1.7058 4.5019 2.1852 12.1845 7.9339 3.4892 6.8863 1.9321 10.2436 21.9858 22.9143 33.3287 82.4224 20.5182 15.8407 18.1499 20.9586 25.8616 119.5669 118.3079 15.1052 7.6742 16.7845 135.0918 1.5913 5.7933 152.1067 206.1489 35.4656 17.7455 14.8699 16.1136 271.1638 137.6992 109.9834 78.9936 77.8567 4.9975 18.1468 6.9437 12.9919 50.2459 48.5757 38.9872 6.0787 2.1529 1.6226 16.0924 0.0343 0.5712 1.1951 2.8801 25.7688 23.5316 14.6478 17.1402 4.4427 4.6551 6.1077 9.0295 7.4634 5.6509 17.2780 63.0982 15.4889 12.6881 7.4436 7.4464 3.1828 4.4622 5.6701 20.6709 0.7812 3.1897 10.5845 8.7402 2.5197 2.2333
temp: 298.150 k
press: 1.00000 atm
elementType: 17 17 17 17 17 17 16 16 16 16 16 8 8 8 8 8 8 6 6 6 6 6 6 6 6 6 6 6 6 6 6 1 1 1 1 1 1 1 1
symmnumber: 1
zpe: 514734.6 jmol-1
zpe.correction: 0.196052 hartree
zpe.thermalcorrener: 0.232357 hartree
zpe.thermalcorrenthalpy: 0.233301 hartree
zpe.thermalcorrgfe: 0.118819 hartree
zpe.sumelectzpe: -5737.472253 hartree
zpe.sumelectthermal: -5737.435948 hartree
zpe.sumelectthermalent: -5737.435004 hartree
zpe.sumelectthermalfe: -5737.549486 hartree
dipole: 0.3024 4.1413 8.4406
dipole: 9.4067
quadrupole: -281.0802 -261.0321 -264.7545
quadrupole: 0.8716 -12.6506 21.4108
quadrupole: -12.1246 7.9235 4.2011 0.8716 -12.6506 21.4108
hfenergy: -5737.6683046 hartree
pointgroup: C01 [X(C14H8Cl6O6S5)]
dipole: 0.4564609 1.5361143 -3.335952 debye
polarizability: 430.7915564|42.4286474|419.1016401|6.1046826|2.1802733|302.3960556 unknown
InChI: InChI=1S/C12H8O6S3.2CCl3S/c13-19(14)9-3-1-5-11(7-9)21(17,18)12-6-2-4-10(8-12)20(15)16;2*2-1(3,4)5/h1-8H;;
charge 0 multiplicity 1
39 atoms
Cl -4.482013 0.288423 -2.604341
Cl -4.374581 -2.751184 -2.670043
Cl -6.185266 -1.313406 -0.69092
Cl 0.109377 -2.131484 1.644508
Cl -0.853279 -4.556487 0.081194
Cl 1.463984 -4.79873 2.042168
S  1.798979 2.977019 0.867622
S  -3.359163 0.655285 1.131863
S  3.821451 -2.284673 0.289996
S  -3.106625 -1.409318 -0.386328
S  1.724317 -3.39942 -0.702019
O  1.795349 2.452303 2.412982
O  2.351988 4.436844 0.381785
O  -4.859123 1.270496 1.005948
O  -2.714061 0.180609 2.546308
O  5.078925 -2.951664 -0.495462
O  3.720347 -2.240695 1.910894
C  0.001396 2.856831 0.238922
C  2.760711 1.673323 -0.139087
C  -0.835579 1.897033 0.827343
C  2.863556 0.383966 0.404141
C  -2.156875 1.900333 0.354433
C  3.61189 -0.517964 -0.36746
C  -0.418794 3.787539 -0.724094
C  3.377172 2.080669 -1.332895
C  -2.65715 2.790254 -0.610422
C  4.245436 -0.199136 -1.5798
C  -1.768247 3.75048 -1.147791
C  4.129713 1.127309 -2.058364
C  -4.535071 -1.259734 -1.530325
C  0.676581 -3.703496 0.775984
H  -0.499266 1.233609 1.632519
H  2.429587 0.121413 1.376089
H  0.284693 4.538342 -1.100114
H  3.294888 3.12129 -1.66441
H  -3.707735 2.75107 -0.913367
H  4.833062 -0.952871 -2.113834
H  -2.130647 4.470253 -1.887629
H  4.630373 1.414767 -2.987594
