program: Gaussian 09
title: 000257535
version: EM64L-G09RevD.01
frameworkgroup: C1[X(C12H9Cl2N3)]
method: RPBEPBE
basis: SDD
operation: Freq
keyword: #p
keyword: freq=noraman
keyword: PBEPBE/SDD
title: #p freq=noraman PBEPBE/SDD
converged: YES YES NO NO
title: Mulliken charges:
elementType: Cl Cl N N N C C C C C C C C C C C C H H H H H H H H H
charge: -0.053889 -0.052249 -0.402693 -0.167333 -0.016559 0.488031 -0.398962 -0.350815 0.174953 -0.175276 -0.170878 -0.129262 -0.331341 -0.277609 -0.188151 -0.185411 -0.115255 0.231835 0.269815 0.256300 0.256285 0.254223 0.263132 0.308593 0.257606 0.254910
chargesum: 0.00000
title: Mulliken charges with hydrogens summed into heavy atoms:
elementType: Cl Cl N N N C C C C C C C C C C C C
charge: -0.053889 -0.052249 -0.094100 -0.167333 -0.016559 0.488031 -0.167127 -0.080999 0.174953 0.081024 0.085407 -0.129262 -0.077118 -0.014477 0.069456 0.069499 -0.115255
polarizability: 4.51609661e+02 -1.45587045e+00 1.64127769e+02 -8.13674933e-02 1.01499972e-01 6.20193238e+01
1716.lowfreq: -11.1792 -0.0016 0.0010 0.0013 2.3590 2.4699 21.1691 31.9257 37.4337
frequency: 21.1021 31.8719 37.4333 68.2255 131.1271 136.8754 194.8415 198.5333 216.3756 252.2586 290.5208 322.8258 351.2015 362.6870 409.5407 413.7346 414.0436 452.4015 503.2070 519.1994 569.5401 619.2477 623.7237 655.5582 695.0081 699.4261 708.4828 715.3118 802.1592 811.5828 825.7350 831.3246 844.5048 911.9278 939.3449 959.5333 963.4612 971.1016 991.0619 992.5445 1068.2667 1072.2310 1102.1223 1107.1536 1159.2726 1161.6941 1178.3711 1210.5490 1264.1058 1286.5366 1294.8233 1350.8166 1369.7139 1379.0435 1406.1560 1410.9653 1464.4176 1470.4367 1502.7322 1572.9443 1590.6097 1593.4904 1607.5661 3133.0458 3157.0720 3157.9249 3164.8987 3174.4138 3176.6247 3179.8835 3189.5238 3390.9258
redmass: 3.8536 5.4535 11.2637 9.7912 7.7232 8.7533 11.5395 7.4804 5.1164 8.2715 5.7683 6.2620 13.3335 6.1218 2.9790 4.8142 3.1567 9.0840 2.7982 2.9044 7.3210 7.2263 7.2184 7.4074 7.0127 2.5178 1.7578 2.6896 6.1270 1.3292 1.2579 1.4682 1.5748 4.5010 1.3488 1.3528 1.3427 1.3485 3.8965 3.7601 2.8322 2.7895 1.4120 1.3766 3.2651 1.2443 1.1433 3.2723 2.0845 1.2930 1.3215 7.4015 5.8035 7.8407 4.2335 3.7120 2.2397 2.0347 2.6017 7.4785 6.6248 6.4400 6.3310 1.0901 1.0884 1.0882 1.0897 1.0956 1.0967 1.0977 1.0961 1.0746
irintensity: 0.1463 0.0001 0.3265 0.0243 0.0670 2.0075 0.1162 3.2587 7.2131 2.2688 4.0304 0.5796 39.1645 3.0598 0.0090 7.8636 0.5145 6.5057 36.8813 14.0406 56.6851 1.6663 1.8286 1.9266 4.9282 12.5419 44.8821 32.4392 32.0102 33.7933 4.4447 36.9360 93.6227 1.7056 0.9022 1.1865 0.6947 0.0843 32.3670 26.9792 88.2480 69.9300 31.9014 4.6741 176.3596 0.9676 2.7416 24.1568 299.9732 24.0184 0.4433 155.1017 24.3808 63.5212 3.2306 10.9822 173.1194 78.2867 391.2309 4.3835 1.1996 23.1571 50.5562 10.4406 4.7478 0.2611 2.9119 5.2151 7.0660 3.1055 0.9136 10.6579
temp: 298.150 k
press: 1.00000 atm
elementType: 17 17 7 7 7 6 6 6 6 6 6 6 6 6 6 6 6 1 1 1 1 1 1 1 1 1
symmnumber: 1
zpe: 483332.7 jmol-1
zpe.correction: 0.184092 hartree
zpe.thermalcorrener: 0.198961 hartree
zpe.thermalcorrenthalpy: 0.199905 hartree
zpe.thermalcorrgfe: 0.139134 hartree
zpe.sumelectzpe: -1545.819516 hartree
zpe.sumelectthermal: -1545.804647 hartree
zpe.sumelectthermalent: -1545.803703 hartree
zpe.sumelectthermalfe: -1545.864473 hartree
dipole: -0.8450 1.9030 0.0000
dipole: 2.0822
quadrupole: -132.3580 -98.0143 -117.7506
quadrupole: -3.6763 -0.0325 0.0492
quadrupole: -16.3170 18.0266 -1.7096 -3.6763 -0.0325 0.0492
hfenergy: -1546.0036078 hartree
pointgroup: C01 [X(C12H9Cl2N3)]
dipole: -0.3522159 -0.6164134 0.4087594 debye
dipolederiv: -0.995948 0.2094711 -0.1931573 0.3173721 -0.1822379 0.0973948 -0.2679232 0.0918562 -0.1419384 -1.0857252 -0.2287038 0.1073657 -0.3395429 -0.1857473 0.0663907 0.1849694 0.0721244 -0.1062663 -2.4582168 0.1289516 -0.2017974 -0.8512176 -0.0869191 -0.1808215 0.4767424 -0.1297583 -0.1698624 -1.2123078 0.0341537 -0.0780539 0.7755314 -0.1156186 0.002831 -0.5937461 -0.0357253 -0.1755852 2.2021688 -0.0145785 0.1232217 0.5939563 -0.0659683 0.0896338 -0.29413 0.058165 -0.035768 1.6290179 -0.2508372 0.2537043 -0.6665644 0.0906085 -0.0317471 0.542139 -0.0106436 0.1300766 -0.4035231 0.0836055 -0.067676 -0.0105224 -0.0139639 -0.126495 -0.0041767 -0.121385 -0.1146816 -0.0954285 -0.005123 0.007717 0.2566608 -0.0847749 -0.0427907 -0.173746 -0.0568044 -0.1377977 0.7725445 0.0727825 -0.011699 0.092494 -0.0240682 0.036382 -0.0250872 0.0353528 -0.0046538 -0.0751826 0.0499093 -0.033628 0.1536791 -0.0233496 -0.0332318 -0.1031326 -0.0387215 -0.0628669 -0.3156092 0.1045309 -0.0834294 -0.0306671 0.0106419 -0.0666874 0.0088546 -0.0596759 -0.0431483 1.1771001 -0.3470732 0.3058916 -0.3469495 0.0898124 -0.1466386 0.3060042 -0.146568 0.0202197 -0.1406166 0.0466589 -0.0325432 -0.0619614 0.0135245 -0.1140285 0.0426544 -0.1084327 -0.0684518 -0.0482701 -0.0237901 0.0202582 0.0030137 -0.057272 -0.0462009 0.0014963 -0.0474933 -0.0905554 -0.1401308 -0.1335878 0.0911925 -0.2137128 -0.1128515 -0.0065925 0.1467547 -0.0024839 -0.0977704 -0.5481364 -0.0642361 0.0218444 0.0392439 0.0006002 -0.067526 -0.0495705 -0.0727752 -0.0516662 1.372943 0.3554267 -0.1742491 0.313009 0.1676012 -0.1522419 -0.1451766 -0.1501036 0.023164 0.0832537 0.0493589 -0.0387867 0.0303466 -0.0047472 0.1218728 -0.0260698 0.1229962 0.0852236 0.0275202 -0.0569179 0.0310415 -0.0767824 0.0919286 0.0476177 0.0441705 0.0488132 0.1362807 -0.0249171 -0.0596363 0.0305342 -0.0610154 0.0908523 0.0469313 0.0313395 0.0470356 0.1337475 0.0825 0.0106663 -0.0115282 0.0284856 0.0267502 0.0934267 -0.0236846 0.0925288 0.0962064 0.1028121 -0.0409093 0.0254831 -0.0203815 0.019348 0.0982377 0.0112693 0.0970803 0.095333 0.0309678 0.0626389 -0.0497905 0.0520864 0.0824432 0.0543398 -0.0425815 0.054835 0.1165496 0.0269971 -0.0089733 -0.0090688 0.0130714 0.1591597 0.1112621 -0.0256246 0.1102836 0.2415815 -0.0256415 0.055242 -0.0480162 0.0558573 0.0921105 0.0544321 -0.0483623 0.0543959 0.1261906 0.0618283 -0.0290298 0.0151697 -0.0454903 0.0221376 0.0942494 0.0266175 0.0951036 0.0964392 unknown
polarizability: 450.7803866|4.2107342|131.1946294|17.1329861|-47.582622|95.7817375 unknown
InChI: InChI=1S/C12H9Cl2N3/c13-9-1-5-11(6-2-9)15-17-16-12-7-3-10(14)4-8-12/h1-8,15H
charge 0 multiplicity 1
26 atoms
Cl -6.552197 1.068771 -1.13249
Cl 6.627739 1.070574 -0.461339
N  -1.132995 -0.985746 0.572368
N  1.069593 -1.027453 0.716832
N  0.038938 -0.383963 0.216691
C  -2.382452 -0.482842 0.15827
C  -3.556781 -1.170806 0.564953
C  -2.487919 0.683229 -0.646759
C  2.337277 -0.459832 0.387463
C  -4.826959 -0.701346 0.173522
C  -3.757615 1.151287 -1.037615
C  -4.912241 0.456148 -0.62422
C  3.461838 -1.144701 0.919985
C  2.539517 0.70389 -0.410736
C  4.771036 -0.686594 0.666907
C  3.84291 1.167092 -0.667374
C  4.941897 0.465524 -0.125094
H  -3.483102 -2.071532 1.185758
H  -1.582033 1.208628 -0.95689
H  -5.732393 -1.22933 0.485312
H  -3.846689 2.048123 -1.657385
H  3.2893 -2.036304 1.530728
H  1.674721 1.232527 -0.82174
H  -1.070776 -1.831118 1.161161
H  5.637483 -1.213404 1.076078
H  4.008903 2.058976 -1.278686
