program: Gaussian 09
title: 000257531
version: EM64L-G09RevD.01
frameworkgroup: C1[X(C8H2Cl5N)]
method: RPBEPBE
basis: SDD
operation: Freq
keyword: #p
keyword: freq=noraman
keyword: PBEPBE/SDD
title: #p freq=noraman PBEPBE/SDD
converged: YES YES NO YES
title: Mulliken charges:
elementType: Cl Cl Cl Cl Cl N C C C C C C C C H H
charge: 0.041511 0.041488 0.069282 0.069282 0.075236 0.007238 0.768522 -0.346132 -0.346173 -0.600716 -0.076062 -0.076070 -0.098085 -0.100940 0.285791 0.285827
chargesum: 0.00000
title: Mulliken charges with hydrogens summed into heavy atoms:
elementType: Cl Cl Cl Cl Cl N C C C C C C C C
charge: 0.041511 0.041488 0.069282 0.069282 0.075236 0.007238 0.768522 -0.346132 -0.346173 -0.029097 -0.076062 -0.076070 -0.098085 -0.100940
polarizability: 1.73442097e+02 -5.47995147e-03 1.72000840e+02 -2.20940820e+00 -3.98594629e-03 6.83294446e+01
1716.lowfreq: -0.0024 -0.0008 0.0019 1.6514 4.4788 5.3675 20.6668 50.2814 63.8285
frequency: 20.6514 50.2809 63.8276 79.6297 112.5141 185.2253 205.2386 206.9496 214.1056 216.9921 296.6513 310.5274 319.3248 329.9574 337.6002 351.4857 372.4575 388.3674 532.8171 584.8711 600.0741 625.7588 634.4367 721.0760 790.4770 816.5904 894.9136 933.0177 945.5310 1066.0483 1196.8173 1221.2973 1307.6481 1327.7268 1345.5606 1360.9492 1441.0369 1529.8742 1551.2687 2206.9509 3017.8700 3076.4807
redmass: 11.2960 16.7539 34.1699 28.8973 14.0505 11.7790 28.2895 30.7640 25.1672 30.1366 7.3461 18.9781 22.7374 12.5600 10.9023 25.5509 2.1777 12.9447 9.1020 5.7561 12.0760 12.5537 12.5584 9.4777 12.0201 12.4198 8.5687 1.9726 4.9785 8.7453 1.2270 9.3313 1.3830 9.6388 5.8762 11.8614 1.0760 9.6465 11.8761 12.4471 1.0590 1.1005
irintensity: 3.1718 1.4737 0.0026 0.4472 1.3448 1.0242 0.1380 0.0461 0.7092 0.0992 3.9913 0.2870 0.6457 0.0000 0.1581 0.5000 2.5528 4.2492 16.8961 1.0710 0.0023 56.6516 15.3253 14.8909 1.6646 0.8826 6.0055 18.8583 1.1260 28.2352 23.7867 41.9970 1.6471 124.5770 35.5469 74.6088 30.9478 0.3694 12.6592 4.8198 2.2011 0.8369
temp: 298.150 k
press: 1.00000 atm
elementType: 17 17 17 17 17 7 6 6 6 6 6 6 6 6 1 1
symmnumber: 1
zpe: 202114.3 jmol-1
zpe.correction: 0.076981 hartree
zpe.thermalcorrener: 0.090942 hartree
zpe.thermalcorrenthalpy: 0.091887 hartree
zpe.thermalcorrgfe: 0.033338 hartree
zpe.sumelectzpe: -2660.073511 hartree
zpe.sumelectthermal: -2660.059550 hartree
zpe.sumelectthermalent: -2660.058606 hartree
zpe.sumelectthermalfe: -2660.117154 hartree
dipole: -0.9962 0.0006 -3.2299
dipole: 3.3801
quadrupole: -123.2678 -114.2537 -117.6762
quadrupole: 0.0019 -13.7418 -0.0018
quadrupole: -4.8686 4.1455 0.7230 0.0019 -13.7418 -0.0018
hfenergy: -2660.1504922 hartree
pointgroup: C01 [X(C8H2Cl5N1)]
dipole: 0.4847382 -0.0001993 -1.2383276 debye
dipolederiv: -0.2219612 0.2712057 -0.0456287 0.2565404 -0.507788 0.0640881 -0.0562094 0.0642894 -0.0131562 -0.2216574 -0.2710394 -0.0455829 -0.2563535 -0.5081367 -0.0641206 -0.0561579 -0.0643018 -0.0131632 -0.159361 0.2755467 -0.02958 0.2840837 -0.4893363 0.05054 -0.0406907 0.0618082 0.0152132 -0.1590278 -0.2753443 -0.0295383 -0.2838941 -0.4896695 -0.0505354 -0.0406301 -0.0617999 0.015221 -0.6408954 -0.0001895 -0.1285071 -0.0001928 0.0020922 -0.0000378 -0.1481164 -0.0000443 -0.0046973 -0.2484107 -0.0000843 -0.0214004 -0.0000038 -0.2019914 0.0000492 0.0781645 0.0001401 -0.1744848 0.0672053 0.0000926 -0.0120521 0.0001223 -0.3234443 -0.0000086 -0.0249357 -0.0000238 -0.0312679 0.2576921 -0.4503821 0.072179 -0.4816565 0.6514916 -0.1208276 0.0618929 -0.0877582 -0.0411572 0.2571295 0.4501534 0.0720967 0.4813882 0.6520995 0.1208829 0.0618227 0.0878013 -0.0411613 0.1799994 0.0000397 0.0276655 0.0000344 0.1111795 0.0000201 0.073957 -0.0000235 0.0861298 -0.0314623 -0.5164485 -0.0112067 -0.5545691 0.6215835 -0.1075087 -0.002134 -0.1167793 -0.0119734 -0.0320878 0.5160723 -0.0112993 0.5541822 0.6222386 0.1074539 -0.00224 0.1167269 -0.0119912 0.9055201 0.0003357 0.1955962 0.0003471 -0.2373469 0.0000693 0.2075786 0.0000752 0.0179675 -0.0686708 0.000037 -0.0997885 -0.0000029 -0.0181366 -0.0000864 -0.1907568 -0.0001417 0.04705 0.0580532 -0.0191125 0.0335395 -0.0688243 0.0575399 -0.0774065 0.0392274 -0.0230622 0.0807557 0.0579349 0.0191174 0.0335072 0.0687987 0.0576248 0.077428 0.039228 0.0230939 0.0807153 unknown
polarizability: 172.5431187|-0.0061338|172.0008395|9.9281066|0.0073896|69.2284232 unknown
InChI: InChI=1S/C8H2Cl5N/c9-4-3(1-2-14)5(10)7(12)8(13)6(4)11/h1H2
charge 0 multiplicity 1
16 atoms
Cl -0.997703 2.779317 -0.481449
Cl -0.995985 -2.78005 -0.481476
Cl 2.138432 -2.779915 0.204014
Cl 2.136759 2.781121 0.203915
Cl 3.707147 0.001076 0.549209
N  -3.862611 -0.000376 1.353283
C  -0.829829 -0.000303 -0.476515
C  -0.115276 1.211175 -0.308254
C  -0.114536 -1.211345 -0.308287
C  -2.315886 -0.000727 -0.822601
C  1.264149 -1.224419 0.002726
C  1.263406 1.225091 0.002719
C  1.955711 0.000545 0.156234
C  -3.170058 -0.000753 0.382791
H  -2.563739 -0.893212 -1.42356
H  -2.564182 0.891377 -1.423948
