program: Gaussian 09
title: 000257530
version: EM64L-G09RevD.01
frameworkgroup: C1[X(C18H20N2)]
method: RPBEPBE
basis: SDD
operation: Freq
keyword: #pfreq=noraman
keyword: PBEPBE/SDD
title: #p freq=noraman PBEPBE/SDD
converged: YES YES NO NO
title: Mulliken charges:
elementType: N N C C C C C C C C C C C C C C C C C C H H H H H H H H H H H H H H H H H H H H
charge: -0.055194 -0.500602 -0.420237 -0.481319 -0.392460 -0.628068 0.532032 -0.535633 0.525193 0.147851 0.095506 0.159804 0.195938 -0.392921 -0.806803 -0.416934 -0.363129 -0.751286 -0.258110 -0.221164 0.216219 0.228995 0.219993 0.214117 0.223775 0.227880 0.224526 0.231745 0.222241 0.311505 0.209246 0.224089 0.221522 0.234655 0.229903 0.223395 0.234155 0.229778 0.219522 0.220275
chargesum: 0.00000
title: Mulliken charges with hydrogens summed into heavy atoms:
elementType: N N C C C C C C C C C C C C C C C C C C
charge: -0.055194 -0.189097 -0.204018 -0.032332 0.045432 -0.175662 0.532032 -0.081647 0.525193 0.147851 0.095506 0.159804 0.195938 -0.183675 -0.361192 -0.182278 -0.133225 -0.063959 -0.038588 -0.000889
polarizability: 2.67812229e+02 -1.52074128e+01 2.05018197e+02 2.43640495e+01 -1.67434395e+01 1.59071777e+02
1716.lowfreq: -9.0551 -2.9873 -0.0008 -0.0006 -0.0004 7.1216 31.1155 57.3521 86.0656
frequency: 30.9054 57.3251 86.0634 99.0708 114.4810 145.2270 153.6478 166.6313 205.6243 251.6428 263.3185 275.9376 297.6950 316.6491 355.3035 384.5402 397.5482 421.4545 431.4987 458.0190 470.8701 507.1284 526.2793 532.3827 568.5296 576.1104 591.8736 598.5704 628.9449 649.9169 704.6098 731.0101 743.1978 748.9725 758.1046 786.1471 806.4694 818.5759 830.1468 847.6215 868.8308 901.4475 912.2963 921.9861 928.5823 934.5134 958.3741 969.2703 978.7591 990.8624 1011.9550 1038.5924 1039.6725 1071.0655 1084.6751 1098.0094 1118.8753 1122.3264 1129.9800 1166.8155 1169.4274 1180.1442 1195.1088 1226.8565 1231.9457 1248.6108 1274.5226 1284.3242 1297.2504 1307.6080 1308.9062 1329.6712 1333.7240 1343.5406 1354.1204 1365.2329 1368.1699 1394.0781 1405.9200 1412.5535 1428.5609 1448.4827 1453.7469 1460.8983 1465.6642 1470.7385 1473.8076 1480.2743 1483.8796 1542.0882 1583.0587 1607.3769 1627.5156 1689.7712 2942.9133 2947.1453 2949.7875 2964.7508 2985.4172 2989.7589 3000.9145 3025.4570 3034.1429 3036.1491 3055.9314 3065.9551 3089.8846 3092.2551 3122.8492 3131.1245 3144.6454 3161.7789 3190.7477 3600.1437
redmass: 3.9907 3.1921 3.9293 3.5876 1.0489 3.4847 4.2851 2.3676 3.5762 2.7931 4.2106 3.3004 2.8194 4.0541 3.5605 2.7172 2.8677 2.6572 3.0718 4.7995 3.5813 4.1875 1.3363 2.9692 2.6958 3.5294 4.1818 3.9552 4.8735 2.6088 2.9705 1.8126 3.8143 1.4054 3.9036 1.9861 2.6927 1.3188 3.4935 1.4461 2.9086 4.3639 1.4404 1.7727 1.6984 2.1596 2.0625 1.3077 2.0213 1.8257 2.0561 2.1221 1.5216 2.1318 2.6835 2.8312 2.0945 2.2440 1.9327 1.0942 2.7534 1.7736 1.1867 1.6692 2.0477 1.5472 1.4189 1.3032 1.4104 1.6953 1.3302 1.6078 2.3786 1.6065 1.4870 1.4967 1.4580 1.2307 4.1924 2.3648 1.6015 1.1146 1.2079 2.8572 1.0542 1.0789 1.0631 2.9085 1.1107 4.1983 6.2317 4.8044 6.8537 7.4758 1.0611 1.0662 1.0668 1.0376 1.0687 1.0997 1.0774 1.0952 1.0968 1.0961 1.1018 1.0899 1.0961 1.0614 1.0846 1.0889 1.0953 1.1001 1.1136 1.0800
irintensity: 0.0678 0.3832 0.0462 0.4739 0.3484 2.3309 0.3049 1.2115 0.9460 2.7582 0.3275 1.7888 3.5866 1.6284 8.1097 4.3327 1.2124 5.4965 0.8340 2.4868 0.5320 5.2243 53.2761 17.9656 22.1533 8.3254 3.0996 15.8848 2.4553 1.0318 3.5774 13.8274 6.0325 98.4403 3.1978 7.1327 9.5631 14.9910 6.5925 0.1745 2.7659 3.6894 53.2996 23.8227 3.8653 1.2165 2.9363 0.0905 6.2023 26.4428 9.7624 2.2135 0.6759 0.6396 10.0724 1.1605 11.8176 20.1399 26.5662 0.6721 8.9083 8.5990 2.7552 7.7128 14.1089 13.8969 0.2616 4.0017 8.2681 12.5861 0.5890 8.2632 64.9587 8.3732 1.1638 3.0842 0.8700 14.6382 37.0106 9.0229 3.2299 10.9417 23.3694 1.3062 17.0964 9.8566 12.3224 1.6658 3.8768 8.5124 1.2595 61.3081 3.3502 0.7484 39.7090 84.0333 67.9228 35.9194 28.1189 16.4281 55.0998 19.5536 27.7593 24.6280 43.3957 6.5672 45.7889 4.2698 0.7173 3.7740 34.9154 38.0894 21.4924 34.1150
temp: 298.150 k
press: 1.00000 atm
elementType: 7 7 6 6 6 6 6 6 6 6 6 6 6 6 6 6 6 6 6 6 1 1 1 1 1 1 1 1 1 1 1 1 1 1 1 1 1 1 1 1
symmnumber: 1
zpe: 881434.0 jmol-1
zpe.correction: 0.335720 hartree
zpe.thermalcorrener: 0.352683 hartree
zpe.thermalcorrenthalpy: 0.353627 hartree
zpe.thermalcorrgfe: 0.291755 hartree
zpe.sumelectzpe: -805.937753 hartree
zpe.sumelectthermal: -805.920791 hartree
zpe.sumelectthermalent: -805.919847 hartree
zpe.sumelectthermalfe: -805.981718 hartree
dipole: -0.9151 1.9186 -0.4209
dipole: 2.1669
quadrupole: -114.3441 -112.2967 -118.8065
quadrupole: 0.4413 1.8706 -3.4332
quadrupole: 0.8050 2.8524 -3.6574 0.4413 1.8706 -3.4332
hfenergy: -806.2734735 hartree
pointgroup: C01 [X(C18H20N2)]
dipole: -0.3699292 -0.7383771 0.2115423 debye
polarizability: 268.4268887|12.9666919|202.3720899|-24.863758|-19.1797032|161.1032235 unknown
InChI: InChI=1S/C18H20N2/c1-3-13-10-20-9-8-14(13)12(2)18-16(11-20)15-6-4-5-7-17(15)19-18/h3-7,14,19H,2,8-11H2,1H3
charge 0 multiplicity 1
40 atoms
N  -1.597139 2.114122 -0.173759
N  1.152294 -1.435499 0.818682
C  -2.565913 -0.482903 0.435117
C  -3.154027 0.714668 1.241152
C  -2.241167 1.96942 1.161363
C  -2.326289 1.423317 -1.260236
C  -2.404694 -0.090976 -1.040305
C  -0.133275 1.989451 -0.204744
C  -1.277217 -1.023712 1.088411
C  0.540361 0.654394 0.111936
C  0.053333 -0.549753 0.661617
C  1.972615 0.489955 -0.064201
C  2.325509 -0.834667 0.373508
C  -2.319663 -0.978939 -2.06668
C  -1.394708 -1.984723 2.058402
C  2.994604 1.345979 -0.558376
C  3.647893 -1.326709 0.309247
C  -2.367962 -2.489117 -1.975413
C  4.31645 0.864246 -0.619695
C  4.639179 -0.458889 -0.19306
H  -3.304559 -1.304827 0.506017
H  -3.300033 0.421838 2.297081
H  -4.153768 0.949704 0.827123
H  -2.841314 2.873015 1.398022
H  -1.445439 1.899411 1.926348
H  -1.840564 1.655377 -2.225756
H  -3.34731 1.857193 -1.306865
H  0.280039 2.750896 0.489719
H  0.202633 2.302133 -1.215272
H  1.044885 -2.41371 1.078784
H  -2.185072 -0.572953 -3.082219
H  -2.374257 -2.394046 2.329855
H  -0.540643 -2.35185 2.638862
H  2.763764 2.364907 -0.888807
H  3.902292 -2.339618 0.640923
H  -3.145951 -2.902721 -2.646426
H  -2.56951 -2.844934 -0.950855
H  -1.403512 -2.930654 -2.296821
H  5.11464 1.511307 -1.000274
H  5.677292 -0.804532 -0.254701
