program: Gaussian 09
title: 000023282
version: EM64L-G09RevD.01
frameworkgroup: C1[X(C11H15N2)]
method: RPBEPBE
basis: SDD
operation: Freq
keyword: #p
keyword: freq=noraman
keyword: PBEPBE/SDD
title: #p freq=noraman PBEPBE/SDD
converged: YES YES NO NO
title: Mulliken charges:
elementType: N N C C C C C C C C C C C H H H H H H H H H H H H H H H
charge: -0.241425 -0.393727 0.556597 -0.558044 -0.557778 -0.597387 -0.532366 0.283197 -0.338486 0.224477 -0.359902 -0.379039 -0.195415 0.280669 0.255416 0.272176 0.255366 0.280133 0.272487 0.277084 0.265001 0.276625 0.271378 0.234312 0.258545 0.274774 0.336842 0.278489
chargesum: 1.00000
title: Mulliken charges with hydrogens summed into heavy atoms:
elementType: N N C C C C C C C C C C C
charge: -0.241425 -0.056886 0.556597 0.250216 0.250209 0.221323 -0.260988 0.283197 -0.104174 0.224477 -0.101357 -0.104265 0.083074
polarizability: 1.86610021e+02 7.68846862e+00 1.25039578e+02 -1.24823947e-02 4.47478120e-03 7.18944519e+01
1716.lowfreq: -5.1043 -0.0004 -0.0003 0.0005 3.9758 6.3148 51.1730 97.0096 184.3027
frequency: 50.6862 96.9991 184.2900 201.5352 222.5020 258.0328 262.5224 284.4873 326.5479 341.0164 376.4449 406.4498 419.4367 461.0603 474.6687 522.6542 584.3062 595.7737 606.6597 636.6620 684.3016 743.4880 775.3805 780.2368 802.5807 817.5709 876.4288 887.4385 895.1061 908.2920 917.4203 936.6561 943.2047 1042.9211 1071.5452 1078.0489 1101.6451 1103.2433 1111.3637 1156.4228 1216.1495 1216.4578 1221.8944 1247.9709 1262.7262 1300.2797 1335.9733 1382.2390 1418.5094 1420.1851 1430.0974 1450.1023 1454.8001 1464.5120 1466.3568 1477.4258 1478.7606 1484.7381 1486.5578 1501.1330 1513.8793 1585.7763 1632.1399 3027.9087 3029.6021 3034.2540 3142.2413 3142.8669 3147.4132 3149.8749 3156.8264 3163.1863 3165.7503 3169.7488 3180.0680 3225.4299 3249.7575 3598.1588
redmass: 3.2067 3.5764 1.0889 3.3852 3.8034 2.7748 1.1017 3.0175 1.1065 3.1059 2.7595 3.1401 2.7256 3.3378 3.3323 3.2688 2.5855 5.0919 1.2866 3.6036 5.8702 2.5798 5.2481 1.2972 1.7180 3.6047 1.4592 4.9705 1.4688 3.8930 2.5189 2.7130 1.3475 1.1913 1.6625 2.0026 1.4149 1.3025 1.4110 1.4368 1.8218 1.8645 1.9775 1.9354 1.4749 2.1919 1.7803 4.3364 1.1436 1.1368 2.3218 1.0484 1.1847 1.0426 1.3278 1.1333 2.0966 1.0458 4.1612 1.0639 3.9670 6.1480 6.9017 1.0324 1.0325 1.0332 1.1051 1.1052 1.0886 1.1052 1.1053 1.1052 1.1023 1.0989 1.0918 1.0925 1.1073 1.0818
irintensity: 0.1664 6.2206 0.0709 2.1733 6.4401 0.9784 0.1601 2.1764 0.5814 3.4053 0.1717 2.1265 9.5505 4.3250 0.2627 0.0271 26.1265 0.7255 82.4254 9.4195 0.5178 12.4279 3.1622 95.0915 5.3581 23.7343 16.9484 20.5184 5.8425 11.3778 33.4347 15.3642 0.5292 0.0605 10.3606 1.7848 14.3545 0.6029 21.2743 0.0343 2.5129 0.2355 0.3125 11.3649 8.9539 2.6430 4.5362 77.1703 15.7829 17.9510 26.4118 0.0625 7.5784 1.9321 3.7223 37.6298 4.0004 33.8015 73.2911 69.1535 0.2676 5.2457 3.5923 3.2921 5.4637 6.7410 0.5475 0.3045 5.6019 20.7059 1.3856 1.2669 1.3548 6.2695 1.4473 1.1153 0.1154 104.4909
temp: 298.150 k
press: 1.00000 atm
elementType: 7 7 6 6 6 6 6 6 6 6 6 6 6 1 1 1 1 1 1 1 1 1 1 1 1 1 1 1
symmnumber: 1
zpe: 633887.9 jmol-1
zpe.correction: 0.241435 hartree
zpe.thermalcorrener: 0.253182 hartree
zpe.thermalcorrenthalpy: 0.254127 hartree
zpe.thermalcorrgfe: 0.204492 hartree
zpe.sumelectzpe: -536.471061 hartree
zpe.sumelectthermal: -536.459313 hartree
zpe.sumelectthermalent: -536.458369 hartree
zpe.sumelectthermalfe: -536.508004 hartree
dipole: -5.0895 -0.4772 -0.0016
dipole: 5.1118
quadrupole: -19.5303 -59.0978 -75.8678
quadrupole: -6.3869 -0.0096 0.0025
quadrupole: 31.9684 -7.5992 -24.3692 -6.3869 -0.0096 0.0025
hfenergy: -536.7124957 hartree
pointgroup: C01 [X(C11H15N2)]
dipole: -2.0044981 0.1437118 0.0772611 debye
polarizability: 186.7824885|-6.0158874|120.675689|-3.7343534|14.240454|76.0858737 unknown
InChI: InChI=1S/C11H15N2/c1-13(2,3)10-4-5-11-9(8-10)6-7-12-11/h4-8,12H,1-3H3
charge 1 multiplicity 1
28 atoms
N  -2.483592 -0.204069 -0.007424
N  3.130611 0.714504 0.161408
C  -0.974703 0.064414 0.044031
C  -3.139327 0.725895 -1.039071
C  -3.100867 0.042818 1.377092
C  -2.814167 -1.640665 -0.407861
C  -0.052905 -0.949014 -0.266773
C  1.329407 -0.637616 -0.200671
C  -0.563642 1.379463 0.416945
C  1.738926 0.695294 0.178879
C  0.802748 1.703937 0.486876
C  2.528778 -1.402555 -0.442813
C  3.606737 -0.549055 -0.21301
H  -2.668254 0.546423 -2.016433
H  -4.218065 0.507651 -1.082863
H  -2.980536 1.771243 -0.743058
H  -4.183042 -0.155371 1.326051
H  -2.617043 -0.632153 2.098067
H  -2.924091 1.084147 1.67658
H  -2.380701 -2.335684 0.325234
H  -3.909362 -1.748941 -0.416128
H  -2.416102 -1.843049 -1.412282
H  -0.351863 -1.959028 -0.555025
H  -1.291261 2.161335 0.656069
H  1.110793 2.713854 0.773866
H  2.597949 -2.444897 -0.746203
H  3.716037 1.518245 0.384575
H  4.674438 -0.745424 -0.28736
