program: Gaussian 09
title: 000257525
version: EM64L-G09RevD.01
frameworkgroup: C1[X(C17H12N2S)]
method: RPBEPBE
basis: SDD
operation: Freq
keyword: #p
keyword: freq=noraman
keyword: PBEPBE/SDD
title: #p freq=noraman PBEPBE/SDD
converged: YES YES NO NO
title: Mulliken charges:
elementType: S N N C C C C C C C C C C C C C C C C C H H H H H H H H H H H H
charge: 0.134955 -0.004270 -0.684501 0.286812 0.474088 -0.266398 0.105720 -0.416881 -0.455488 -0.463127 -0.335054 -0.394877 0.495247 -0.234901 -0.223214 -0.377521 -0.315598 -0.410336 -0.427542 0.508464 0.238403 0.238211 0.242259 0.253929 0.229034 0.227473 0.274798 0.237096 0.220388 0.220044 0.311258 0.311528
chargesum: 0.00000
title: Mulliken charges with hydrogens summed into heavy atoms:
elementType: S N N C C C C C C C C C C C C C C C C C
charge: 0.134955 -0.004270 -0.061714 0.286812 0.474088 -0.266398 0.105720 -0.416881 -0.217085 -0.224916 -0.092795 -0.140948 0.495247 -0.005867 0.004259 -0.102723 -0.078502 -0.189948 -0.207498 0.508464
polarizability: 4.56945940e+02 1.08564583e+01 2.47778737e+02 1.78606610e-02 -1.05208992e-01 7.95239201e+01
1716.lowfreq: -6.0869 -3.7748 -0.0012 -0.0011 0.0011 7.2984 27.1130 31.9996 70.2883
frequency: 27.1114 31.9596 70.2853 87.0982 123.9622 172.4551 216.8430 223.7126 250.9967 269.3633 335.7907 353.6255 379.8508 399.6065 406.2463 408.4989 412.9261 420.9091 473.9848 477.0063 490.1030 505.8195 526.0047 546.9415 589.0287 611.3746 619.0123 626.9821 650.3487 653.1524 739.4414 765.3990 770.3791 773.4346 782.7027 811.7651 813.5936 838.7500 840.5643 878.1001 890.7289 916.0292 919.6138 945.5354 973.8295 984.3188 987.5739 997.7089 1018.3834 1029.4573 1079.8396 1083.0302 1135.8952 1157.6668 1173.0862 1186.4461 1197.6844 1212.2089 1235.9701 1289.2555 1317.3629 1330.0221 1356.2167 1383.5882 1385.6406 1399.4616 1423.0784 1439.2975 1449.8991 1500.5122 1518.5898 1559.7131 1568.9323 1587.6635 1600.7784 1619.5873 1633.0583 1646.1322 3122.0282 3124.4050 3127.0066 3128.3966 3140.8833 3148.4266 3149.2690 3160.9010 3167.9921 3170.8034 3560.4010 3700.3639
redmass: 7.2806 3.8989 6.6756 5.5908 5.1362 4.3898 7.0550 4.1512 4.8245 5.1387 5.1295 9.6752 3.7723 1.1264 1.5045 1.7789 4.8311 6.9675 3.3818 4.1291 7.6484 3.1342 7.6625 7.3412 3.9970 4.3222 7.5618 7.4189 3.2130 7.6510 3.6567 1.3327 6.2329 1.7423 5.8418 1.3212 5.3176 1.8597 2.1984 7.6095 1.4112 1.4763 6.4871 1.3943 1.3396 1.3656 1.3491 2.7560 1.5757 3.3537 1.8540 2.6106 1.2332 1.4214 1.3456 1.3087 1.4109 1.9083 1.9071 2.4217 1.4691 2.8423 2.6255 5.2260 4.2657 5.2618 2.2210 2.6168 4.4041 4.4117 3.1527 7.4411 6.5778 5.8919 9.3731 7.1722 2.8181 1.5378 1.0894 1.0877 1.0864 1.0860 1.0919 1.0958 1.0936 1.0995 1.0945 1.0971 1.0450 1.1040
irintensity: 1.2039 0.4461 2.4254 1.5911 0.2191 1.4240 0.9322 1.6961 5.8726 0.3654 4.0273 0.7988 4.2170 12.6226 227.4128 78.3538 4.2683 1.3571 0.0524 0.0762 8.4685 5.4276 2.5285 17.2067 4.1159 7.9093 3.2573 19.5564 2.9425 17.1847 1.0242 4.8554 4.4696 75.6794 1.0323 12.3459 8.1422 13.0605 129.8190 73.7855 3.7935 0.2540 40.9815 0.0447 0.1806 2.9530 0.9825 1.1367 1.2292 29.0398 3.5884 0.9922 25.2304 6.2786 35.7943 202.7854 29.2088 32.7137 3.6115 25.3547 19.4776 149.2210 4.3891 3.9193 9.3074 15.0725 7.0937 7.8960 14.4591 58.5828 88.0942 564.6427 19.9653 1.3850 199.4971 24.4760 61.7114 437.3739 14.3558 38.4232 3.3395 0.0379 14.3532 11.7571 34.5400 34.7510 7.6827 15.1187 178.0197 23.2314
temp: 298.150 k
press: 1.00000 atm
elementType: 16 7 7 6 6 6 6 6 6 6 6 6 6 6 6 6 6 6 6 6 1 1 1 1 1 1 1 1 1 1 1 1
symmnumber: 1
zpe: 635275.7 jmol-1
zpe.correction: 0.241964 hartree
zpe.thermalcorrener: 0.257694 hartree
zpe.thermalcorrenthalpy: 0.258639 hartree
zpe.thermalcorrgfe: 0.198053 hartree
zpe.sumelectzpe: -1161.252048 hartree
zpe.sumelectthermal: -1161.236318 hartree
zpe.sumelectthermalent: -1161.235373 hartree
zpe.sumelectthermalfe: -1161.295959 hartree
dipole: -4.0294 -0.0217 -0.0056
dipole: 4.0295
quadrupole: -69.2406 -109.4229 -132.6550
quadrupole: -0.9364 0.0251 -0.0946
quadrupole: 34.5322 -5.6500 -28.8822 -0.9364 0.0251 -0.0946
hfenergy: -1161.4940119 hartree
pointgroup: C01 [X(C17H12N2S1)]
dipole: 1.5853264 -0.0005147 -0.0019347 debye
polarizability: 457.0468366|-9.7367596|247.0800244|-1.5316518|9.9888396|80.1217363 unknown
InChI: InChI=1S/C17H12N2S/c18-13-9-7-12(8-10-13)17-19-14-5-1-3-11-4-2-6-15(20-17)16(11)14/h1-10H,18H2
charge 0 multiplicity 1
32 atoms
S  0.011677 -1.827359 -0.110675
N  0.078965 0.991477 0.050492
N  6.499437 0.103289 -0.012289
C  -2.225234 -0.034286 -0.000822
C  -3.656678 0.207437 0.01751
C  -1.771683 -1.393384 -0.08015
C  -1.324317 1.100965 0.061231
C  0.773776 -0.11004 -0.01499
C  -4.561845 -0.902438 -0.042899
C  -4.141175 1.555875 0.095858
C  -2.67622 -2.461566 -0.138271
C  -1.848536 2.404859 0.137173
C  2.246101 -0.095776 -0.017483
C  -4.078886 -2.209761 -0.119239
C  -3.251899 2.63159 0.154403
C  2.925561 1.156465 0.064453
C  3.035959 -1.277106 -0.098703
C  4.323197 1.227407 0.066698
C  4.43794 -1.218302 -0.097723
C  5.110501 0.037226 -0.0146
H  -5.639744 -0.705452 -0.028114
H  -5.224092 1.724632 0.108596
H  -2.306567 -3.490687 -0.198449
H  -1.139286 3.236388 0.182399
H  -4.772993 -3.055747 -0.165334
H  -3.630987 3.657428 0.213931
H  2.318314 2.064335 0.126302
H  2.554557 -2.259066 -0.164823
H  4.821789 2.202319 0.13165
H  5.023045 -2.143587 -0.161501
H  7.062696 -0.740378 -0.071222
H  6.978628 0.99724 0.048689
