program: Gaussian 09
title: 000257522
version: EM64L-G09RevD.01
frameworkgroup: C1[X(C8H13NO3S2)]
method: RPBEPBE
basis: SDD
operation: Freq
keyword: #p
keyword: freq=noraman
keyword: PBEPBE/SDD
title: #p freq=noraman PBEPBE/SDD
converged: NO YES NO NO
title: Mulliken charges:
elementType: S S O O O N C C C C C C C C H H H H H H H H H H H H H
charge: 0.189718 0.005248 -0.240266 -0.417000 -0.210266 -0.032540 -0.355199 -0.362659 -0.295561 -0.292101 -0.425058 -0.450839 -0.675711 0.271504 0.257461 0.234523 0.239984 0.246966 0.228347 0.212096 0.211154 0.227010 0.325627 0.235531 0.242618 0.249409 0.380006
chargesum: 0.00000
title: Mulliken charges with hydrogens summed into heavy atoms:
elementType: S S O O O N C C C C C C C C
charge: 0.189718 0.005248 -0.240266 -0.036994 -0.210266 -0.032540 0.136784 0.124291 0.144882 0.146063 -0.425058 -0.125212 0.051847 0.271504
polarizability: 1.85189683e+02 -4.41601597e+00 1.39478310e+02 3.88796941e+00 -2.16564106e+00 9.60638741e+01
1716.lowfreq: -20.7462 -2.4281 -0.0012 -0.0007 0.0007 5.0039 20.5596 26.4621 46.9908
frequency: 20.0329 24.4044 46.6544 54.8470 69.4866 106.3671 156.8790 203.0959 218.3245 240.5692 262.1704 277.6879 280.7156 306.6948 381.2096 396.9698 409.7403 420.2883 461.0021 514.4989 519.5749 554.6273 584.7627 611.9978 675.7678 700.3926 786.1975 809.2435 815.0591 826.6959 886.0646 960.3410 991.9724 1004.7070 1015.1776 1023.1183 1046.5351 1062.4050 1069.4578 1097.3592 1105.2121 1162.7466 1192.7919 1225.6011 1232.6451 1237.8476 1258.9146 1276.9028 1322.9667 1328.6116 1341.2597 1348.7213 1370.2533 1390.6715 1427.2129 1443.9320 1448.0306 1455.4849 1467.8951 1470.6724 1479.7588 1677.0120 2964.4559 2969.4187 2992.3847 2996.7619 2997.7418 3060.0473 3079.1496 3087.7985 3092.0561 3093.4479 3100.7830 3105.8182 3521.8196
redmass: 8.0253 3.7915 6.4608 6.6230 8.1415 4.1915 4.6988 3.3263 1.3970 2.6742 2.9416 3.3473 4.7518 3.5891 4.0883 2.3615 5.7998 5.7859 3.2083 4.6593 7.2363 2.3811 1.6924 2.2237 4.3066 3.5744 4.7401 3.2798 3.6486 1.7818 2.9994 4.0407 1.6543 2.5779 2.5987 2.8770 2.1160 2.7310 4.0333 1.5870 2.1337 4.3011 1.0620 1.3239 1.3319 1.3885 1.3313 1.1984 1.8135 1.2490 1.2172 1.3408 1.2613 1.1920 1.9322 1.0823 1.0815 1.0986 1.4412 1.0541 1.0520 9.1400 1.0674 1.0674 1.0626 1.0642 1.0346 1.0853 1.0992 1.0963 1.0985 1.0995 1.1003 1.1008 1.0641
irintensity: 1.1793 0.8175 0.8023 2.9580 1.4442 0.7290 2.4089 5.3057 0.4842 0.3775 1.8909 11.5020 5.8544 4.9736 9.2756 3.3729 4.9833 11.8939 2.0226 22.5236 5.7037 46.0046 112.5327 6.6029 12.9076 39.6006 19.1870 4.0381 14.7614 1.0741 20.5088 140.4083 18.9402 6.7360 4.1692 342.5828 17.4945 6.9571 27.9673 27.2303 0.2926 21.4050 2.1394 70.4636 87.2895 3.4635 67.2456 27.3096 17.1696 4.0954 2.8654 1.2702 0.3606 18.0081 156.7998 19.5051 0.5251 8.9964 85.1901 16.2167 9.6577 169.0188 37.5403 41.7857 24.3287 61.6581 19.3395 2.7022 14.6912 30.2861 7.0776 34.8121 11.0648 14.7699 26.7155
temp: 298.150 k
press: 1.00000 atm
elementType: 16 16 8 8 8 7 6 6 6 6 6 6 6 6 1 1 1 1 1 1 1 1 1 1 1 1 1
symmnumber: 1
zpe: 548008.8 jmol-1
zpe.correction: 0.208726 hartree
zpe.thermalcorrener: 0.224067 hartree
zpe.thermalcorrenthalpy: 0.225011 hartree
zpe.thermalcorrgfe: 0.163432 hartree
zpe.sumelectzpe: -1388.086573 hartree
zpe.sumelectthermal: -1388.071232 hartree
zpe.sumelectthermalent: -1388.070288 hartree
zpe.sumelectthermalfe: -1388.131867 hartree
dipole: 0.0617 -1.6092 -0.8013
dipole: 1.7987
quadrupole: -90.8106 -94.1382 -101.1588
quadrupole: 2.0468 -3.8808 4.8690
quadrupole: 4.5586 1.2310 -5.7896 2.0468 -3.8808 4.8690
hfenergy: -1388.295299 hartree
pointgroup: C01 [X(C8H13N1O3S2)]
dipole: -0.0138564 0.3032981 -0.6392311 debye
polarizability: 185.0017134|4.3993878|96.205447|-5.3021116|2.5593712|139.5247064 unknown
InChI: InChI=1S/C8H13NO3S2/c1-6(7(10)11)14-8(13)9-2-4-12-5-3-9/h6,10H,2-5H2,1H3
charge 0 multiplicity 1
27 atoms
S  -1.078442 0.232153 -1.121822
S  -0.626644 0.607495 1.949248
O  4.03867 -0.471165 -0.286323
O  -3.985269 -1.205258 1.302757
O  -2.266176 -2.337465 0.224915
N  1.34756 0.540629 0.051157
C  2.388091 0.785086 1.085054
C  1.932256 0.376175 -1.305724
C  3.432933 -0.345606 1.051905
C  2.994416 -0.745889 -1.28174
C  0.013974 0.471935 0.368664
C  -2.765148 0.059763 -0.308777
C  -3.84179 0.223248 -1.406706
C  -2.908048 -1.286009 0.406689
H  1.893685 0.843608 2.068713
H  2.875877 1.754895 0.864674
H  2.404465 1.333018 -1.602622
H  1.149441 0.129871 -2.040279
H  4.268385 -0.122138 1.734662
H  2.959301 -1.306172 1.344971
H  2.503051 -1.718132 -1.064734
H  3.514674 -0.803475 -2.251758
H  -2.840493 0.856263 0.449367
H  -3.755145 -0.55714 -2.182614
H  -3.750365 1.211796 -1.887398
H  -4.840834 0.148204 -0.943938
H  -4.092327 -2.080392 1.764359
