program: Gaussian 09
title: 000257515
version: EM64L-G09RevD.01
frameworkgroup: C1[X(C16H12N2O12S)]
method: RPBEPBE
basis: SDD
operation: Freq
keyword: #p
keyword: freq=noraman
keyword: PBEPBE/SDD
title: #p freq=noraman PBEPBE/SDD
converged: YES YES NO NO
title: Mulliken charges:
elementType: S O O O O O O O O O O O O N N C C C C C C C C C C C C C C C C H H H H H H H H H H H H
charge: 0.874747 -0.520058 -0.520058 -0.207252 -0.207253 -0.166050 -0.166049 -0.197124 -0.197125 -0.406767 -0.406771 -0.195264 -0.195265 0.014273 0.014268 -0.075630 -0.075614 -0.343413 -0.343440 -0.244321 -0.244300 0.273421 0.273427 0.302498 0.302515 -0.285928 -0.285958 -0.399657 -0.399648 0.198248 0.198259 0.321830 0.321832 0.287680 0.287682 0.256177 0.256174 0.299808 0.254906 0.299807 0.254896 0.395248 0.395248
chargesum: 0.00000
title: Mulliken charges with hydrogens summed into heavy atoms:
elementType: S O O O O O O O O O O O O N N C C C C C C C C C C C C C C C C
charge: 0.874747 -0.520058 -0.520058 -0.207252 -0.207253 -0.166050 -0.166049 -0.197124 -0.197125 -0.011518 -0.011523 -0.195264 -0.195265 0.014273 0.014268 -0.075630 -0.075614 -0.021583 -0.021608 0.043360 0.043383 0.273421 0.273427 0.302498 0.302515 -0.029751 -0.029785 0.155057 0.155055 0.198248 0.198259
polarizability: 3.37580694e+02 1.76345120e-03 2.02280197e+02 -6.18599109e+00 -2.71686508e-02 2.73176106e+02
1716.lowfreq: -4.9509 -2.7256 -2.2193 0.0008 0.0012 0.0014 8.8075 13.7172 15.3861
frequency: 8.8053 13.7167 15.3848 29.8511 31.3365 35.2468 38.8259 43.8610 45.9857 51.0211 57.0142 90.9589 101.3129 109.1481 117.4217 144.1774 150.8699 165.8618 170.3218 210.2712 210.9965 216.1154 229.9965 245.7180 248.7363 303.9259 305.9931 321.4803 323.9824 341.4069 350.6466 373.5602 401.6823 407.3762 421.0654 423.4685 457.6489 483.2965 483.3012 492.6037 493.9178 531.9265 539.1456 579.1356 580.6121 601.7296 612.6774 624.6314 625.1370 635.7584 636.0482 653.9981 654.8701 687.0783 691.5159 745.4715 745.5913 751.5701 751.8711 780.3912 820.2456 820.9350 823.1533 828.5985 834.5522 835.8869 926.3426 931.9069 933.6325 964.7644 967.0634 997.5239 998.1256 1006.2516 1006.4192 1046.4083 1048.1628 1070.4984 1074.1475 1077.0436 1080.5217 1159.3628 1160.5507 1205.1735 1205.5054 1216.4318 1217.2622 1238.9761 1240.9018 1253.8837 1253.9622 1275.5491 1275.8950 1357.1918 1357.3991 1364.1711 1365.3830 1385.9417 1388.4575 1407.8588 1409.3351 1451.8837 1451.9797 1463.8589 1467.2717 1585.7954 1590.0205 1596.0177 1596.5113 1687.4463 1688.4676 3011.7107 3011.7357 3104.4298 3104.4493 3155.9180 3156.0276 3167.7125 3167.7526 3178.8143 3179.0387 3521.9345 3521.9659
redmass: 8.9223 10.3472 10.0931 8.3882 10.0744 9.0192 9.0617 15.3552 12.8087 9.1396 10.6400 9.5442 9.6529 7.7456 6.1605 5.3688 5.9582 7.2930 7.8065 10.6553 10.2533 8.7816 4.8184 8.5270 7.8869 9.3050 4.7096 9.2277 7.1578 7.7306 7.5101 8.2986 6.5822 7.2198 4.9153 4.6527 8.4614 4.9783 4.8227 1.8292 1.8947 3.9368 4.1419 5.4561 5.5035 6.5610 7.7235 2.1205 2.2113 2.3709 2.4122 7.9171 7.9439 7.2749 7.4587 4.8953 4.8324 5.0875 5.4814 15.3338 2.0879 2.9531 2.2138 3.1729 4.6291 5.0512 1.8351 1.4823 5.3669 1.3666 1.3689 4.6787 4.3415 2.4300 2.5286 2.8461 2.8294 1.9521 2.5256 6.9162 3.8064 1.3025 1.2957 9.3119 9.8534 1.3636 1.3237 1.8597 1.8945 1.3781 1.3690 2.1268 2.1936 1.7284 1.6612 4.6320 5.3502 8.0693 7.5826 6.0715 5.9392 1.0895 1.0891 2.6449 2.6384 8.7754 8.8097 6.8949 6.9269 9.2210 9.2220 1.0649 1.0649 1.0973 1.0973 1.0896 1.0896 1.0922 1.0922 1.0952 1.0953 1.0645 1.0645
irintensity: 2.7247 0.2536 3.0843 0.3503 0.2582 0.6335 0.0266 0.9264 0.0377 2.1578 1.2766 4.0813 3.9148 2.7742 0.1694 2.4832 0.2428 1.5818 0.4576 7.5821 7.7855 1.2342 1.2499 4.9062 1.9200 10.3265 0.0179 1.2090 2.9154 0.6845 4.2122 0.1764 6.7776 34.7757 5.5413 9.5273 142.6102 40.8567 37.4894 20.2733 22.8607 4.3609 90.5745 20.8945 38.6482 12.4487 41.4887 32.6391 62.5402 63.9712 127.5361 19.3867 0.0343 0.3575 16.7839 1.0316 4.0901 5.7572 7.0990 82.2786 66.0696 19.2481 36.7427 0.7039 33.4783 15.4615 22.5454 22.4968 31.8027 0.0914 0.7009 259.2944 83.1480 147.1089 43.7524 342.8078 99.0675 77.3284 1.1655 5.0812 6.5368 11.0874 62.9780 1.2021 479.6080 31.5532 16.4548 138.7101 123.4944 55.1092 31.2857 32.5005 23.6709 21.1649 27.8406 22.6480 87.5314 6.3257 108.6733 0.9731 23.7829 69.1249 9.9839 260.3870 67.9096 0.0085 48.1182 94.5270 66.3094 415.0299 5.6424 38.7713 0.9598 1.8274 4.5168 0.1594 4.0228 21.8168 3.6192 17.2022 7.4385 46.3514 43.9030
temp: 298.150 k
press: 1.00000 atm
elementType: 16 8 8 8 8 8 8 8 8 8 8 8 8 7 7 6 6 6 6 6 6 6 6 6 6 6 6 6 6 6 6 1 1 1 1 1 1 1 1 1 1 1 1
symmnumber: 1
zpe: 725472.8 jmol-1
zpe.correction: 0.276318 hartree
zpe.thermalcorrener: 0.306170 hartree
zpe.thermalcorrenthalpy: 0.307115 hartree
zpe.thermalcorrgfe: 0.208331 hartree
zpe.sumelectzpe: -2024.522738 hartree
zpe.sumelectthermal: -2024.492885 hartree
zpe.sumelectthermalent: -2024.491941 hartree
zpe.sumelectthermalfe: -2024.590724 hartree
dipole: 0.0002 5.4086 0.0020
dipole: 5.4086
quadrupole: -153.8393 -195.7971 -196.4189
quadrupole: 0.0251 -59.4623 0.0018
quadrupole: 28.1791 -13.7787 -14.4004 0.0251 -59.4623 0.0018
hfenergy: -2024.7990557 hartree
pointgroup: C01 [X(C16H12N2O12S1)]
dipole: 0.0003125 -2.1279255 0.0012756 debye
polarizability: 336.8907504|0.0305679|202.2802201|9.0678214|0.0453736|273.8660261 unknown
InChI: InChI=1S/C16H12N2O12S/c19-15(20)7-29-13-3-1-9(5-11(13)17(23)24)31(27,28)10-2-4-14(30-8-16(21)22)12(6-10)18(25)26/h1-6,19,21H,7-8H2
charge 0 multiplicity 1
43 atoms
S  -0.000253 2.697823 -0.001694
O  0.020612 3.459945 -1.44928
O  -0.021479 3.461624 1.4450
O  -4.901052 -0.894899 -0.016415
O  4.902165 -0.892698 0.017285
O  -5.105477 -0.124723 2.557714
O  5.106277 -0.125975 -2.557589
O  -3.015746 -0.065148 3.472991
O  3.016604 -0.067897 -3.473116
O  -5.366679 -3.046822 -2.959462
O  5.368413 -3.041529 2.962514
O  -3.557836 -2.948495 -1.486465
O  3.559876 -2.945721 1.488977
N  -3.831744 0.026732 2.472666
N  3.832533 0.025596 -2.472885
C  -1.506614 1.554984 -0.028406
C  1.506634 1.555709 0.02636
C  -2.078134 1.180723 1.189568
C  2.078363 1.1803 -1.191164
C  -2.040644 1.179099 -1.271389
C  2.040802 1.18151 1.269788
C  -3.234771 0.376941 1.159995
C  3.235369 0.377077 -1.160632
C  -3.791737 -0.066781 -0.079539
C  3.792468 -0.065005 0.07943
C  -3.179925 0.355022 -1.290299
C  3.180449 0.357961 1.289682
C  -5.497068 -1.408194 -1.242042
C  5.498263 -1.404521 1.243495
C  -4.666346 -2.533498 -1.865869
C  4.668071 -2.529731 1.868211
H  -1.66915 1.517107 2.147455
H  1.669268 1.515403 -2.149452
H  -1.581904 1.535789 -2.199482
H  1.58189 1.539087 2.197455
H  -3.578135 0.032753 -2.255428
H  3.578775 0.037016 2.255201
H  -6.472426 -1.81411 -0.93053
H  -5.680772 -0.611646 -1.987997
H  6.473896 -1.81018 0.932519
H  5.681402 -0.607183 1.988743
H  -4.859573 -3.795983 -3.374995
H  4.861636 -3.790559 3.378683
