program: Gaussian 09
title: 000257501
version: EM64L-G09RevD.01
frameworkgroup: C1[X(C8H9NO2S)]
method: RPBEPBE
basis: SDD
operation: Freq
keyword: #p
keyword: freq=noraman
keyword: PBEPBE/SDD
title: #p freq=noraman PBEPBE/SDD
converged: YES YES NO NO
title: Mulliken charges:
elementType: S O O N C C C C C C C C H H H H H H H H H
charge: 0.969356 -0.553406 -0.539009 -0.710493 0.470340 -0.155759 -0.467948 -0.375259 -0.357668 -0.229496 -0.225516 -0.228415 0.279789 0.285905 0.240143 0.230014 0.235701 0.233799 0.236654 0.338201 0.323066
chargesum: 0.00000
title: Mulliken charges with hydrogens summed into heavy atoms:
elementType: S O O N C C C C C C C C
charge: 0.969356 -0.553406 -0.539009 -0.049226 0.470340 0.124030 -0.182043 -0.135116 -0.127654 0.006205 0.008283 0.008239
polarizability: 2.14297876e+02 1.07271743e+01 1.18924633e+02 -2.01285439e-01 1.61249635e+00 7.11543187e+01
1716.lowfreq: -4.0585 -0.0023 -0.0016 -0.0015 1.3180 6.1180 34.5002 63.7704 81.1914
frequency: 34.4830 63.7609 81.1785 110.4131 156.5272 183.3818 219.0698 242.5288 270.2236 299.9973 340.2111 385.3630 402.8047 423.8354 473.3789 508.9736 567.6617 614.8982 693.8024 696.5006 757.4573 793.3670 806.7330 816.7175 833.0980 850.2665 910.8983 927.6556 981.4025 989.9781 996.3990 1007.4540 1026.2296 1063.2374 1084.3875 1166.2423 1178.5971 1196.3177 1234.6800 1292.1945 1337.4037 1387.2024 1439.6257 1484.6673 1531.5713 1583.0871 1610.8718 1622.4135 3082.0858 3128.7487 3132.6871 3144.3219 3155.6915 3170.4412 3204.7952 3361.4064 3529.1863
redmass: 4.6262 5.1493 5.7006 3.5881 1.7316 8.2867 6.5468 1.6880 3.2025 4.5285 6.4878 10.0970 2.7518 4.5146 4.0525 3.2584 6.2657 6.4548 1.9245 3.9570 1.5544 2.0994 3.4267 2.0660 4.7069 1.2575 4.3160 1.3909 1.3832 6.1873 1.2799 1.3109 2.1909 1.4260 1.6046 1.1720 1.0631 1.1190 2.4772 1.5010 1.2562 7.3950 2.2708 2.2661 1.0873 5.8316 5.9676 6.0592 1.0886 1.0864 1.0874 1.0919 1.0966 1.1017 1.0973 1.0414 1.1001
irintensity: 1.2106 2.7490 0.2673 1.6469 32.1228 2.8648 3.4738 23.8076 5.6033 7.6788 3.2928 72.1192 0.1169 26.2903 174.4440 8.4797 18.8349 0.0351 36.4996 27.2633 97.2824 38.9679 180.3877 21.2110 27.3402 0.4197 67.7882 0.0575 1.9277 0.9429 30.4155 17.0498 3.8119 34.1793 2.7630 12.7632 2.0808 2.7739 19.4551 6.0989 9.6282 5.1826 12.5591 8.6500 20.8055 5.7722 8.8983 35.4060 0.8163 3.5082 0.5065 8.1035 31.2128 22.3134 12.5384 26.8282 22.4997
temp: 298.150 k
press: 1.00000 atm
elementType: 16 8 8 7 6 6 6 6 6 6 6 6 1 1 1 1 1 1 1 1 1
symmnumber: 1
zpe: 404269.1 jmol-1
zpe.correction: 0.153978 hartree
zpe.thermalcorrener: 0.166329 hartree
zpe.thermalcorrenthalpy: 0.167273 hartree
zpe.thermalcorrgfe: 0.114444 hartree
zpe.sumelectzpe: -912.429617 hartree
zpe.sumelectthermal: -912.417266 hartree
zpe.sumelectthermalent: -912.416322 hartree
zpe.sumelectthermalfe: -912.469151 hartree
dipole: 4.1803 -1.0037 3.1080
dipole: 5.3049
quadrupole: -70.0185 -76.9499 -83.6349
quadrupole: 3.0067 -13.1253 0.5938
quadrupole: 6.8493 -0.0821 -6.7672 3.0067 -13.1253 0.5938
hfenergy: -912.5835951 hartree
pointgroup: C01 [X(C8H9N1O2S1)]
dipole: -1.6171399 -0.4894357 -1.2252867 debye
dipolederiv: 2.4128624 -0.2301124 -0.1567953 0.2465652 1.2369659 0.1000159 -0.2307563 0.1185398 1.5432332 -0.7500424 0.0124203 0.0388993 -0.1259814 -0.7051553 -0.083671 0.0395032 0.078289 -0.5168784 -0.8553052 0.0570959 -0.0708725 0.0356347 -0.5046724 0.1311817 -0.0151746 -0.0097315 -0.6205737 -0.8045934 0.0571695 0.1328328 0.1209937 -0.5961929 -0.2006524 0.1962076 -0.2309022 -0.6955124 -0.2516807 -0.0238812 -0.0086577 -0.0352789 0.0012713 0.0042295 0.01858 0.0041293 0.0526299 0.6906036 -0.0244949 0.0332941 -0.2759192 0.0384524 -0.0179478 0.0686493 -0.015531 -0.0587842 -0.6509901 0.0931898 -0.0347157 0.1935649 -0.092722 -0.0095574 -0.1410504 -0.0078353 -0.3673141 -0.0020279 0.1185959 -0.0061577 -0.1036822 0.0555258 -0.030019 0.0198634 -0.0171691 -0.1497187 0.0118169 -0.086489 0.0197285 0.0846618 0.0008245 -0.0153665 -0.0022308 -0.024526 -0.1270051 -0.0427115 -0.1517008 0.025815 -0.2015874 0.0423014 -0.0333838 0.0282513 -0.0316114 -0.1383524 -0.1713129 0.1209502 -0.0156728 0.200675 0.0928233 -0.0232818 -0.030519 -0.0265585 -0.1388412 0.0758765 0.020079 0.0098329 -0.0334615 -0.0081025 -0.0194285 0.0146392 -0.0172454 -0.1419002 0.1357456 -0.0147862 -0.0052242 -0.029204 0.0279582 0.0109388 -0.010459 0.0159594 0.1416029 -0.0853931 -0.0537634 -0.0056631 -0.0843398 0.0432827 0.0158338 -0.0004111 0.0130565 0.1926609 0.0575191 -0.0961395 0.0069381 -0.0650825 -0.0397414 0.0231445 0.0046108 0.0206258 0.1527772 0.0394285 0.104895 -0.0205707 0.0815886 -0.0130152 0.0238664 -0.0164528 0.0267742 0.138226 -0.0030611 0.088907 -0.0191684 0.1098135 -0.0376709 0.0313186 -0.0221739 0.0305809 0.1558825 0.0331586 -0.066238 0.003152 -0.0979911 -0.0695024 0.0263087 0.007036 0.0275421 0.1548511 -0.1196227 -0.0192268 -0.0106812 -0.023622 0.0926736 0.0079999 -0.0106206 0.0081568 0.1591143 0.08117 0.0350307 -0.0235972 -0.0584779 0.322502 0.0165683 0.0510525 -0.0262292 0.1009836 0.1985599 0.058499 0.1072837 0.0611303 0.112194 0.0419018 0.0314552 0.0636857 0.1629187 unknown
polarizability: 213.3169919|-13.3008754|118.5782158|5.9587996|-7.7991064|72.4816199 unknown
InChI: InChI=1S/C8H9NO2S/c9-12(10,11)7-6-8-4-2-1-3-5-8/h1-7H,9H2
charge 0 multiplicity 1
21 atoms
S  3.074916 -0.079616 0.281636
O  3.119194 1.532705 0.024888
O  3.802745 -0.76681 1.564792
N  3.771655 -0.982462 -1.167677
C  -1.112433 0.114836 -0.002006
C  0.343467 0.32609 0.042976
C  1.294321 -0.623715 0.213062
C  -1.950694 1.249051 -0.194391
C  -1.715843 -1.167787 0.139449
C  -3.353157 1.108778 -0.245222
C  -3.115905 -1.305946 0.088426
C  -3.940337 -0.169455 -0.10424
H  0.699269 1.36306 -0.069613
H  1.209499 -1.703342 0.348138
H  -1.495211 2.240863 -0.30164
H  -1.091554 -2.055117 0.291621
H  -3.985259 1.990869 -0.392547
H  -3.570377 -2.296391 0.199668
H  -5.029302 -0.281916 -0.142374
H  4.707309 -1.328578 -0.895098
H  3.793295 -0.354114 -1.988249
