program: Gaussian 09
title: 000257481
version: EM64L-G09RevD.01
frameworkgroup: C1[X(C13H23NO3)]
method: RPBEPBE
basis: SDD
operation: Freq
keyword: #p
keyword: freq=noraman
keyword: PBEPBE/SDD
title: #p freq=noraman PBEPBE/SDD
converged: YES YES NO NO
title: Mulliken charges:
elementType: O O O N C C C C C C C C C C C C C H H H H H H H H H H H H H H H H H H H H H H H
charge: -0.270823 -0.278810 -0.239332 -0.413038 0.302587 -0.420068 0.318880 -0.724757 -0.707987 -0.726852 -0.789565 -0.713037 0.204929 -0.253075 -0.296696 0.231154 -0.504311 0.256325 0.188760 0.208108 0.223457 0.211568 0.228402 0.184654 0.208038 0.223369 0.208478 0.209055 0.213333 0.223632 0.235809 0.210721 0.207655 0.268898 0.316768 0.276500 0.254546 0.245227 0.243386 0.234111
chargesum: 0.00000
title: Mulliken charges with hydrogens summed into heavy atoms:
elementType: O O O N C C C C C C C C C C C C C
charge: -0.270823 -0.278810 -0.239332 -0.096270 0.302587 0.025017 0.318880 -0.081624 -0.086893 -0.085950 -0.116791 -0.025764 0.204929 0.023425 -0.042150 0.231154 0.218414
polarizability: 2.09008091e+02 1.59287005e+01 1.50280924e+02 2.32084166e+00 1.16832550e+01 1.36187241e+02
1716.lowfreq: -20.7924 -6.4060 -0.0005 -0.0004 0.0006 1.8828 14.6513 33.5908 34.9501
frequency: 1.3663 33.2977 34.5147 63.4928 69.9714 88.7583 96.6919 136.4634 148.8955 174.6933 183.3824 196.0457 206.6740 227.0653 236.9069 239.7031 267.5012 269.2005 276.0008 289.4977 296.8608 308.7865 340.5123 355.1722 376.2283 390.9593 413.2391 420.1261 461.9282 497.8364 525.6816 552.6818 618.5848 628.6781 681.1780 731.4992 732.9068 792.7886 859.0022 867.8911 874.6286 895.6490 905.2766 918.9535 925.3222 936.1191 938.5295 978.3097 979.1694 993.2682 1003.2658 1010.7301 1024.8372 1033.2050 1112.6410 1129.9833 1135.4462 1149.0784 1149.5922 1207.8523 1213.2460 1232.0256 1247.1505 1254.4218 1270.4032 1293.4867 1323.5640 1351.9086 1368.4902 1373.8031 1378.5308 1397.9776 1401.5735 1422.2278 1451.3204 1452.5479 1456.2871 1459.6527 1461.6198 1462.1235 1467.2589 1469.7463 1476.4350 1483.6128 1485.4305 1487.7524 1496.1862 1501.0719 1575.7170 1626.8610 1642.4929 2964.8754 2967.3230 2972.5354 2976.9788 2980.6701 2985.8108 3003.8176 3038.8056 3056.1422 3057.0062 3065.3982 3067.7838 3068.3098 3074.8622 3080.1254 3090.3929 3099.7075 3104.8107 3105.4753 3140.1969 3146.4818 3150.2660 3532.2241
redmass: 3.5180 3.2273 4.8548 3.9857 4.8485 1.8163 1.6132 3.6029 2.4897 1.9503 3.1763 3.0624 1.6498 3.0203 1.3434 1.1034 1.7918 1.1218 3.3856 1.8014 2.0556 1.7880 3.2944 2.1955 4.0292 2.4347 2.2948 2.2970 2.3010 3.3510 1.2280 2.9981 4.3332 4.2480 5.1331 6.7167 4.1215 3.4062 2.3286 2.8552 3.6509 2.3442 2.1441 1.7548 1.5792 1.4841 1.2917 1.8288 2.9485 1.3084 2.0971 1.6035 1.4767 1.4162 1.2685 2.1269 2.0737 1.7232 1.8456 2.6292 2.4203 2.7927 1.4510 3.2195 2.9383 1.6382 1.4702 1.3628 1.2081 1.2040 1.1989 1.2179 1.2231 1.1805 1.0495 1.0874 1.0934 1.0622 1.0498 1.0509 1.1167 1.1495 1.0515 1.0606 1.1210 1.2620 1.0945 1.0731 6.4251 10.3799 6.1638 1.0348 1.0363 1.0487 1.0475 1.0369 1.0372 1.0297 1.0989 1.0994 1.0996 1.0985 1.1002 1.0993 1.0990 1.0999 1.0958 1.0987 1.1044 1.1000 1.0974 1.0862 1.1046 1.0773
irintensity: 1.1202 0.0779 0.6577 0.6676 4.5365 0.3584 0.1321 10.4810 0.1516 3.1612 3.1355 1.6717 1.2992 6.5954 0.7636 1.0842 2.6144 0.8856 14.3813 2.6617 3.8841 0.1950 4.8369 0.6296 8.1918 4.7861 2.3347 2.6964 0.6577 10.5478 67.3795 9.5300 17.6854 0.6453 3.5375 14.8065 4.8119 3.7543 9.4621 4.7362 4.1783 0.7827 3.5286 1.1565 1.4744 1.7953 0.9864 3.6702 38.0933 56.3663 3.2474 2.7099 0.1318 0.0136 0.1616 177.8895 95.7458 6.6785 22.9481 5.2778 7.9188 95.6806 83.8560 16.9063 36.3072 139.7314 1.3352 20.3277 13.5352 10.6148 44.7854 31.7111 14.8268 22.1595 14.6903 27.4316 27.5614 2.0894 1.5051 12.2362 30.4310 42.0586 20.1923 18.3358 22.8783 101.6762 29.6130 29.3259 154.5455 169.3121 21.4292 41.4887 38.4156 20.0512 29.4129 19.7548 39.0588 34.4614 3.8119 36.0440 9.0549 105.6504 4.5567 26.2841 63.7375 44.9973 35.7617 33.3438 25.2387 11.8943 5.1109 3.2888 16.5921 12.9714
temp: 298.150 k
press: 1.00000 atm
elementType: 8 8 8 7 6 6 6 6 6 6 6 6 6 6 6 6 6 1 1 1 1 1 1 1 1 1 1 1 1 1 1 1 1 1 1 1 1 1 1 1
symmnumber: 1
zpe: 891872.5 jmol-1
zpe.correction: 0.339696 hartree
zpe.thermalcorrener: 0.360725 hartree
zpe.thermalcorrenthalpy: 0.361669 hartree
zpe.thermalcorrgfe: 0.286863 hartree
zpe.sumelectzpe: -788.240650 hartree
zpe.sumelectthermal: -788.219621 hartree
zpe.sumelectthermalent: -788.218677 hartree
zpe.sumelectthermalfe: -788.293483 hartree
dipole: -0.5942 2.4842 4.3401
dipole: 5.0360
quadrupole: -95.7588 -107.4290 -109.2554
quadrupole: 9.1995 3.9782 -6.5642
quadrupole: 8.3889 -3.2812 -5.1077 9.1995 3.9782 -6.5642
hfenergy: -788.5803466 hartree
pointgroup: C01 [X(C13H23N1O3)]
dipole: 0.3655818 0.5347691 -1.872413 debye
polarizability: 207.9793979|-13.4089719|143.732403|10.9381998|-14.5838557|143.7644552 unknown
InChI: InChI=1S/C13H23NO3/c1-12(2,3)9-13(4,5)14-10(15)7-8-11(16)17-6/h7-8,14H,9H2,1-6H3
charge 0 multiplicity 1
40 atoms
O  0.342877 -1.390664 2.195996
O  -4.029667 0.834292 -1.122789
O  -4.520951 -0.638862 0.625504
N  0.635776 -1.166382 -0.125338
C  2.78982 1.372923 0.271523
C  2.819208 -0.146468 0.659713
C  2.13138 -1.266719 -0.19538
C  3.255557 2.145216 1.542479
C  1.375009 1.885887 -0.107431
C  3.788743 1.710202 -0.871754
C  2.494896 -1.237002 -1.699294
C  2.562285 -2.641766 0.395316
C  -0.127671 -1.2203 1.022045
C  -1.608256 -1.048906 0.840632
C  -2.202911 -0.220317 -0.064044
C  -3.67787 -0.067305 -0.107346
C  -5.48274 1.079149 -1.278756
H  2.391862 -0.247085 1.675475
H  3.886438 -0.438243 0.745403
H  3.327858 3.230251 1.338013
H  2.545512 1.998715 2.377491
H  4.250595 1.795943 1.878685
H  0.64212 1.667081 0.690283
H  1.006872 1.433529 -1.046596
H  1.400341 2.982704 -0.254135
H  3.500007 1.260049 -1.836234
H  4.807458 1.356597 -0.621702
H  3.840701 2.805783 -1.020331
H  2.099813 -0.339388 -2.207907
H  2.091147 -2.132353 -2.209317
H  3.590378 -1.241592 -1.823856
H  2.050889 -3.465543 -0.135074
H  3.653068 -2.77654 0.280276
H  2.306437 -2.701189 1.465732
H  0.138074 -1.094087 -1.015386
H  -2.228663 -1.577897 1.575076
H  -1.634919 0.389566 -0.775994
H  -5.898724 1.505269 -0.350239
H  -6.006751 0.135865 -1.507997
H  -5.560901 1.790788 -2.112243
