program: Gaussian 09
title: 000257474
version: EM64L-G09RevD.01
frameworkgroup: C1[X(C15H15NO5S)]
method: RPBEPBE
basis: SDD
operation: Freq
keyword: #p
keyword: freq=noraman
keyword: PBEPBE/SDD
title: #p freq=noraman PBEPBE/SDD
converged: YES YES NO NO
title: Mulliken charges:
elementType: S O O O O O N C C C C C C C C C C C C C C C H H H H H H H H H H H H H H H
charge: 0.898623 -0.542848 -0.510401 -0.477714 -0.431787 -0.241115 -0.245607 -0.421606 -0.077544 0.284975 -0.339420 -0.327780 -0.248283 -0.309820 -0.272541 0.267610 -0.221950 -0.341133 -0.223850 -0.215753 -0.231241 0.122384 0.237134 0.243688 0.209466 0.213281 0.331164 0.334557 0.248399 0.277417 0.251511 0.280598 0.231894 0.238807 0.236239 0.380485 0.392161
chargesum: 0.00000
title: Mulliken charges with hydrogens summed into heavy atoms:
elementType: S O O O O O N C C C C C C C C C C C C C C C
charge: 0.898623 -0.542848 -0.510401 -0.097228 -0.039626 -0.241115 -0.245607 0.059215 -0.077544 0.284975 0.083327 0.003385 0.086273 -0.061421 0.004877 0.267610 0.029560 -0.060535 0.008044 0.023054 0.004999 0.122384
polarizability: 2.47724012e+02 -1.74400233e+01 2.82415974e+02 -8.75260975e+00 1.46572465e+00 1.75456632e+02
1716.lowfreq: -6.4369 -3.9041 0.0011 0.0012 0.0015 5.4353 19.0463 23.6658 48.6960
frequency: 19.0162 23.5752 48.6818 61.3527 70.6840 82.6795 97.0764 109.8447 126.6745 146.4076 168.9584 176.8866 188.0631 200.0724 212.3351 226.1230 257.3768 274.6491 317.8212 329.4127 372.9008 382.5973 406.5553 411.0117 423.9990 432.9754 441.1182 494.8968 503.1049 529.3706 588.7404 594.4184 603.7393 607.2020 644.5523 682.0724 686.0664 730.1075 750.5548 759.8627 769.3961 775.7144 796.9282 829.2140 832.5146 845.5310 911.1967 922.6242 929.7497 956.3049 970.1695 973.7443 980.8564 982.2297 996.4966 1001.2214 1014.3859 1016.4007 1021.6746 1039.8912 1047.6898 1068.7167 1087.8612 1103.8406 1145.1715 1173.9872 1180.0098 1187.7313 1195.8704 1230.6545 1258.6174 1285.7911 1315.4968 1321.9289 1339.7256 1368.8946 1384.4558 1387.3458 1409.5868 1422.1414 1426.1603 1438.2031 1449.2888 1459.2772 1465.9558 1560.4751 1567.9058 1592.9780 1603.4646 1643.8996 2934.0684 2981.8725 3006.8040 3064.0023 3104.2217 3130.9771 3142.7035 3153.2572 3154.3747 3166.9534 3171.4622 3174.1526 3188.6411 3222.9894 3534.4010
redmass: 7.2898 4.9544 6.0437 6.3010 6.0356 5.2337 7.6692 5.1609 6.9256 5.7115 4.2692 6.0314 5.9837 6.1612 7.6924 7.1306 6.2684 3.3670 4.5362 4.8712 7.5055 8.5500 3.4150 4.0247 3.2565 6.4621 2.7608 5.9161 4.6147 3.2118 4.4086 4.6346 1.3635 6.0803 7.0475 3.1783 1.6926 3.1924 1.3458 3.8187 5.2942 1.9909 5.7568 1.4059 1.4578 2.2872 3.7317 1.5143 4.2655 1.3948 1.9389 1.3911 2.7181 4.7937 1.3862 3.1541 2.7172 1.7328 2.1309 2.4408 2.1752 2.9707 1.5640 1.6144 1.7556 1.0588 1.2757 1.1243 1.1083 2.6738 1.1833 1.2983 1.3696 2.6682 1.3661 1.2671 5.6659 7.5560 1.1579 1.3853 1.7011 2.3908 1.0896 2.4803 2.0191 6.2200 5.5059 5.8339 6.6966 9.1389 1.0616 1.0647 1.0941 1.1019 1.0953 1.0853 1.0888 1.0894 1.0943 1.0987 1.0959 1.0948 1.0968 1.0694 1.0643
irintensity: 0.5597 0.2569 1.0262 0.6364 1.3724 2.9225 4.5590 4.4823 16.1052 3.3196 1.2933 3.8204 7.1230 5.4850 5.0994 1.9225 5.2157 5.5662 9.4673 13.6568 26.6738 13.1450 13.2063 13.0868 24.2964 29.3573 16.6830 6.2857 25.7941 11.6337 12.2721 37.5182 143.4443 1.9123 0.7101 0.4391 44.4072 54.0568 441.3726 27.0720 23.3032 45.8962 44.7360 1.7815 20.4124 7.1433 6.3877 3.6905 26.1715 4.8779 3.5126 0.9750 1.6988 10.2783 0.6079 25.8396 128.9391 62.9109 11.5631 14.4813 13.0706 30.2820 11.4778 16.0030 90.9019 0.8327 11.2565 15.5399 5.4138 22.2092 6.5223 7.7289 1.3745 105.1337 8.5809 6.9772 6.8060 5.9499 30.5146 20.7772 7.7261 14.5248 4.2846 8.7020 7.2573 39.9774 2.1892 10.5958 14.5101 288.0008 19.1745 47.3010 32.1326 41.3214 44.1814 1.9914 3.9092 3.2703 20.9686 27.4658 0.3003 19.3894 4.8598 230.1986 51.6538
temp: 298.150 k
press: 1.00000 atm
elementType: 16 8 8 8 8 8 7 6 6 6 6 6 6 6 6 6 6 6 6 6 6 6 1 1 1 1 1 1 1 1 1 1 1 1 1 1 1
symmnumber: 1
zpe: 717782.0 jmol-1
zpe.correction: 0.273389 hartree
zpe.thermalcorrener: 0.294577 hartree
zpe.thermalcorrenthalpy: 0.295522 hartree
zpe.thermalcorrgfe: 0.221758 hartree
zpe.sumelectzpe: -1407.753302 hartree
zpe.sumelectthermal: -1407.732114 hartree
zpe.sumelectthermalent: -1407.731169 hartree
zpe.sumelectthermalfe: -1407.804933 hartree
dipole: -0.0821 3.8194 -4.5261
dipole: 5.9229
quadrupole: -138.4229 -129.3270 -138.1018
quadrupole: -6.4391 7.6033 7.4777
quadrupole: -3.1390 5.9570 -2.8179 -6.4391 7.6033 7.4777
hfenergy: -1408.026691 hartree
pointgroup: C01 [X(C15H15N1O5S1)]
dipole: -0.2449747 -1.4962143 -1.769557 debye
polarizability: 248.7786402|-17.5652287|282.2716509|-3.0857615|1.7585083|174.5463267 unknown
InChI: InChI=1S/C8H10NO.C7H5O4S/c10-7-6-9-8-4-2-1-3-5-8;8-7(9)5-2-1-3-6(4-5)12(10)11/h1-5,10H,6-7H2;1-4,8H
charge 0 multiplicity 1
37 atoms
S  1.067166 0.924576 1.175979
O  1.528928 2.391168 1.758535
O  1.110685 -0.358706 2.177169
O  1.72098 3.601168 -0.657858
O  -3.338081 -2.095694 1.386759
O  -5.107007 -1.031636 0.319186
N  2.41703 0.418161 -0.443367
C  2.127363 1.30408 -1.612924
C  -0.734821 1.050645 0.558974
C  2.272248 -0.981661 -0.633494
C  2.633583 2.746727 -1.413369
C  -1.577836 -0.031545 0.847327
C  -1.135771 2.2032 -0.14329
C  1.621458 -1.586959 -1.755703
C  2.848993 -1.819249 0.370738
C  -2.924044 0.05839 0.410591
C  -2.485171 2.267967 -0.568272
C  -3.372075 1.206086 -0.294242
C  1.586664 -2.987604 -1.878926
C  2.789238 -3.220589 0.245839
C  2.163808 -3.810134 -0.878084
C  -3.905204 -1.032226 0.676572
H  1.05702 1.321031 -1.915967
H  2.693955 0.86524 -2.460264
H  2.721476 3.222349 -2.406269
H  3.638432 2.711766 -0.945257
H  -1.220017 -0.900245 1.407839
H  -0.424209 3.010369 -0.360807
H  1.159081 -0.965635 -2.529784
H  3.348103 -1.348425 1.221192
H  -2.834535 3.150652 -1.112736
H  -4.418409 1.244028 -0.614517
H  1.104223 -3.445184 -2.749665
H  3.235179 -3.852269 1.020973
H  2.127634 -4.900402 -0.978362
H  1.79107 3.379944 0.323226
H  -4.030636 -2.791287 1.546762
