program: Gaussian 09
title: 000257473
version: EM64L-G09RevD.01
frameworkgroup: C1[X(C13H19NO6S)]
method: RPBEPBE
basis: SDD
operation: Freq
keyword: #p
keyword: freq=noraman
keyword: PBEPBE/SDD
title: #p freq=noraman PBEPBE/SDD
converged: YES YES NO NO
title: Mulliken charges:
elementType: S O O O O O O N C C C C C C C C C C C C C H H H H H H H H H H H H H H H H H H H
charge: 0.902454 -0.466843 -0.466422 -0.542950 -0.518340 -0.437431 -0.237892 -0.296602 -0.392842 -0.411419 -0.019586 -0.036015 0.028430 -0.756749 -0.712500 -0.338451 -0.270136 0.263859 -0.193181 -0.320171 0.124764 0.230989 0.233777 0.240086 0.239448 0.306807 0.285003 0.249074 0.194337 0.244996 0.203987 0.213194 0.243893 0.305032 0.296243 0.330387 0.358805 0.247075 0.283971 0.390920
chargesum: 0.00000
title: Mulliken charges with hydrogens summed into heavy atoms:
elementType: S O O O O O O N C C C C C C C C C C C C C
charge: 0.902454 -0.136456 -0.107617 -0.542950 -0.518340 -0.046511 -0.237892 -0.296602 0.071924 0.068115 0.287221 0.248988 0.028430 -0.068343 -0.051426 -0.033418 0.026107 0.263859 0.053894 -0.036200 0.124764
polarizability: 2.52779904e+02 3.49814747e+00 2.11996394e+02 4.99551691e+00 -7.50854227e+00 1.37310192e+02
1716.lowfreq: -5.4392 -0.0008 -0.0006 -0.0004 4.4890 5.8253 12.0237 20.8233 34.1463
frequency: 11.6294 20.4180 34.0619 43.6432 66.4088 80.0117 84.8977 99.9021 123.0045 143.4457 153.9970 164.2767 195.0842 199.7494 214.3085 223.5277 232.7328 243.5316 251.7860 268.8470 282.9865 301.0910 315.9539 340.4890 361.9562 374.8340 394.0330 402.6962 419.0832 426.2205 445.4948 450.6182 498.6492 504.6694 514.9823 591.3435 604.5937 613.0965 650.2007 659.1107 681.6213 728.1759 765.8783 786.1409 792.3836 805.2372 826.8402 834.7738 868.3402 892.8187 903.4301 915.0091 940.4828 945.5565 962.2241 981.2799 1010.2763 1019.6316 1023.4751 1043.8364 1066.6688 1075.2483 1087.3522 1100.4166 1116.1778 1125.1698 1142.2444 1150.0841 1176.9939 1210.0801 1243.5627 1275.0407 1284.4628 1302.4574 1316.6153 1323.3176 1335.1655 1352.4712 1368.4914 1381.8914 1388.5553 1389.6894 1391.5042 1410.9715 1414.5372 1422.0712 1425.3640 1460.7934 1464.3185 1468.2001 1474.1203 1478.7761 1571.3082 1610.4381 1646.8075 2964.5557 2971.7335 2972.4697 2983.3988 3042.3422 3046.2962 3054.3199 3056.9293 3076.6213 3083.2862 3095.7961 3097.1752 3149.3227 3164.4357 3165.3923 3184.8891 3368.0796 3533.6542 3539.0030
redmass: 5.3230 4.3690 5.2419 5.9895 7.5657 4.5473 3.5964 5.3788 5.0386 4.9388 5.3751 5.8684 3.9877 4.8555 3.1467 1.5652 2.9895 1.6274 3.9089 4.0164 1.1907 2.6594 3.9592 2.9750 6.3411 4.3114 5.0669 4.2890 3.0614 2.1898 2.5518 3.6098 6.1188 3.7659 3.3651 4.8022 1.3509 5.4850 1.6028 2.8179 2.8677 3.2465 7.4905 4.4923 4.5655 3.0556 1.4892 3.2088 1.8925 2.2955 1.8076 9.0459 1.4941 2.0548 1.3894 5.9193 1.3651 1.4072 4.4635 1.9860 1.9471 3.4397 1.6233 2.1791 2.2079 2.2875 2.9081 1.8083 1.1100 1.3765 1.3588 1.3542 1.3008 1.2615 1.2721 2.3261 1.2782 1.2258 1.1852 1.2103 1.3001 5.9506 1.1817 1.0918 1.0978 2.7559 1.1245 2.6004 1.0558 1.0531 1.0498 1.0460 6.7576 6.9588 9.0536 1.0420 1.0376 1.0617 1.0586 1.1002 1.0968 1.0907 1.0972 1.0926 1.0929 1.0998 1.0975 1.0880 1.0935 1.0933 1.0973 1.0669 1.0643 1.0660
irintensity: 0.1670 0.2188 3.3764 1.9050 0.0786 1.6097 6.9867 1.1423 6.1632 3.9722 2.0817 2.7410 11.1368 8.1407 8.4603 1.1297 9.2620 14.5902 11.8877 13.6877 103.2534 4.6869 29.3363 7.8253 13.4653 36.3497 53.3040 24.0634 8.7625 3.8243 13.2554 125.4200 0.7716 12.6626 6.0439 62.6261 138.5527 110.5041 247.5662 98.5289 0.0994 69.5812 17.2930 6.3940 30.2956 15.2774 18.3912 54.1812 11.2620 23.1475 2.7429 37.8928 8.6298 23.1435 0.9789 8.0165 0.8697 78.2437 287.4878 72.9014 6.7750 44.1028 17.7479 17.6842 33.8056 32.9350 6.5815 124.4417 0.6917 13.8068 7.7217 26.6064 21.9243 6.9143 10.8493 94.8100 9.8313 3.1921 2.8120 21.4329 27.1511 3.9482 22.0658 18.1039 6.2572 51.7971 6.8499 8.2412 6.2149 3.9606 11.6181 15.4990 19.2727 6.1476 210.2152 23.3688 17.7765 29.0490 19.1815 7.5315 6.7002 15.7775 16.2973 13.5424 12.1382 19.4368 31.0767 5.4201 2.3392 9.0225 4.1446 111.0859 57.2308 3.6799
temp: 298.150 k
press: 1.00000 atm
elementType: 16 8 8 8 8 8 8 7 6 6 6 6 6 6 6 6 6 6 6 6 6 1 1 1 1 1 1 1 1 1 1 1 1 1 1 1 1 1 1 1
symmnumber: 1
zpe: 811880.6 jmol-1
zpe.correction: 0.309229 hartree
zpe.thermalcorrener: 0.332500 hartree
zpe.thermalcorrenthalpy: 0.333444 hartree
zpe.thermalcorrgfe: 0.254763 hartree
zpe.sumelectzpe: -1409.137382 hartree
zpe.sumelectthermal: -1409.114111 hartree
zpe.sumelectthermalent: -1409.113166 hartree
zpe.sumelectthermalfe: -1409.191848 hartree
dipole: -3.6100 -3.2147 -5.3434
dipole: 7.2054
quadrupole: -120.6394 -125.4932 -136.7255
quadrupole: 1.8628 -8.9031 1.6156
quadrupole: 6.9800 2.1262 -9.1062 1.8628 -8.9031 1.6156
hfenergy: -1409.4466108 hartree
pointgroup: C01 [X(C13H19N1O6S1)]
dipole: -1.5271207 -1.3053886 -2.0000361 debye
polarizability: 252.8686601|3.586051|211.9324834|-1.9371051|-8.454383|137.2853467 unknown
InChI: InChI=1S/C13H19NO6S/c1-9(15)7-14(8-10(2)16)21(19,20)12-5-3-4-11(6-12)13(17)18/h3-6,9-10,15-17H,7-8H2,1-2H3
charge 0 multiplicity 1
40 atoms
S  0.494853 -0.227059 0.824897
O  4.322173 -0.40364 -1.931886
O  3.103392 1.410002 0.968889
O  0.407311 1.20339 1.637364
O  1.180949 -1.570543 1.455366
O  -5.822634 0.499836 -0.66046
O  -4.268641 2.222716 -0.527332
N  1.163564 0.119346 -0.914193
C  1.962437 -1.031198 -1.410349
C  1.633479 1.520054 -1.062051
C  3.456556 -1.158429 -0.988354
C  2.972805 1.961002 -0.386455
C  -1.297246 -0.702839 0.448078
C  3.888494 -2.62965 -0.899208
C  3.068213 3.496852 -0.382626
C  -2.215272 0.308776 0.146223
C  -1.632178 -2.064839 0.523191
C  -3.554339 -0.07669 -0.116491
C  -2.973685 -2.430701 0.260946
C  -3.929754 -1.444642 -0.061531
C  -4.531257 1.00048 -0.443627
H  1.905259 -0.967376 -2.516887
H  1.420738 -1.946957 -1.109334
H  0.816382 2.170485 -0.695205
H  1.718054 1.676253 -2.15617
H  3.610106 -0.658039 -0.018583
H  3.821145 1.527744 -0.938545
H  3.334619 -3.141849 -0.092627
H  3.700323 -3.173557 -1.84798
H  4.966499 -2.693727 -0.670965
H  3.035774 3.907366 -1.410089
H  2.237883 3.945216 0.196275
H  4.019466 3.806284 0.082454
H  -1.936815 1.367248 0.128925
H  -0.870235 -2.800253 0.80222
H  4.458067 -0.955644 -2.744652
H  2.293768 1.654237 1.505446
H  -3.268311 -3.483284 0.315285
H  -4.96896 -1.717037 -0.264142
H  -6.432381 1.256663 -0.871913
