program: Gaussian 09
title: 000257471
version: EM64L-G09RevD.01
frameworkgroup: C1[X(C11H15NO5S)]
method: RPBEPBE
basis: SDD
operation: Freq
keyword: #p
keyword: freq=noraman
keyword: PBEPBE/SDD
title: #p freq=noraman PBEPBE/SDD
converged: YES YES NO NO
title: Mulliken charges:
elementType: S O O O O O N C C C C C C C C C C C H H H H H H H H H H H H H H H
charge: 0.924071 -0.521480 -0.534692 -0.445977 -0.438302 -0.236456 -0.317406 -0.378982 -0.321081 -0.011863 -0.305776 -0.681187 -0.341862 -0.273168 0.262745 -0.194514 -0.319921 0.124413 0.236386 0.225741 0.219225 0.252759 0.195615 0.269276 0.242274 0.282027 0.211490 0.312464 0.305443 0.247517 0.284101 0.336486 0.390636
chargesum: 0.00000
title: Mulliken charges with hydrogens summed into heavy atoms:
elementType: S O O O O O N C C C C C C C C C C C
charge: 0.924071 -0.521480 -0.534692 -0.109491 -0.047666 -0.236456 -0.317406 0.083145 0.150904 -0.011863 0.159114 0.054605 -0.029398 0.032275 0.262745 0.053003 -0.035820 0.124413
polarizability: 2.19106204e+02 6.94929624e+00 1.74113455e+02 -1.06774272e+01 3.81399008e+00 1.21992891e+02
1716.lowfreq: -19.5450 -13.6624 -4.1522 -0.0021 -0.0012 -0.0008 12.6524 21.4043 45.4864
frequency: -5.3179 19.9644 45.4395 58.8150 67.9391 86.8852 103.0260 122.6637 151.0270 163.7364 179.5438 189.3448 206.6203 216.8240 226.6480 240.3789 264.1407 291.3665 320.1118 353.8281 377.1006 396.2000 409.5169 418.6803 422.4755 478.9157 497.6603 506.3202 572.0865 591.8190 607.0321 655.8664 683.2431 727.2713 728.9537 768.2242 776.7317 800.6361 829.5463 857.0945 896.5166 929.0161 938.1893 967.1893 979.0483 980.8270 995.3807 1012.5008 1022.1568 1045.8525 1064.6525 1083.8979 1086.4267 1100.9026 1149.7333 1159.5039 1175.8778 1181.6371 1273.1120 1274.0905 1296.4991 1321.7436 1322.5514 1347.8019 1352.8624 1368.2658 1389.1679 1393.3656 1420.8076 1426.9593 1433.5370 1459.6547 1462.6055 1474.2222 1494.5107 1570.4536 1609.4539 1647.3830 2952.0814 2965.1727 2988.2205 2996.5845 3019.6177 3063.2898 3079.2297 3106.1761 3116.3368 3146.9165 3162.6366 3165.5315 3184.1832 3532.1329 3559.6634
redmass: 5.1036 5.6084 6.2164 4.5456 6.9181 2.8689 5.3294 3.3311 4.2106 3.8609 3.4717 6.5795 4.0268 2.5238 5.9353 4.6817 1.6608 1.5802 3.1246 4.9567 3.1615 5.7249 4.1205 3.0586 3.3575 3.8210 6.1374 3.5879 3.4071 4.7348 1.3586 6.8491 2.9232 2.8492 2.5904 7.3028 1.4712 11.1124 1.4601 3.2687 2.0572 14.9492 1.5039 1.3864 1.7314 5.7167 2.5453 1.3620 4.6005 3.5491 1.9373 1.7538 1.6282 1.8836 1.8136 1.3872 1.1153 2.3285 1.2837 1.3519 1.1361 1.2485 2.2781 1.2009 1.2116 1.1960 7.9279 1.1916 2.8089 1.0942 1.0838 2.5874 1.0760 1.0453 1.0463 6.7267 6.9371 9.0584 1.0656 1.0660 1.0367 1.0622 1.0990 1.1006 1.0976 1.0953 1.1024 1.0883 1.0938 1.0930 1.0971 1.0643 1.0664
irintensity: 0.6569 0.8438 1.2877 3.7731 0.2819 0.9314 0.2867 6.8138 1.2893 3.8113 1.4647 4.2454 2.6332 16.3315 8.5617 7.2632 41.2577 93.8864 19.4585 13.1223 59.4001 15.4878 7.3717 12.0471 17.6717 39.7715 1.9656 3.9031 133.4416 35.4995 167.6849 9.1893 0.8081 28.3182 71.9533 17.8557 3.4172 61.2035 22.7809 44.1648 12.7843 73.7078 7.6357 0.4714 91.9259 8.4529 15.6927 0.9675 314.7277 6.9215 3.1919 10.7875 19.4956 5.3243 118.0115 24.1127 0.7631 26.6104 15.6692 22.6679 19.3956 24.3755 83.6968 3.1056 6.2718 20.1676 1.5725 33.5307 33.0415 19.8169 12.5583 8.2258 10.7371 4.5107 10.4769 16.2740 7.7874 215.4122 28.3387 57.8743 25.5784 18.8992 21.2602 8.5048 30.5572 5.6697 3.2430 6.3199 6.0964 6.6747 4.2799 55.8955 5.4661
temp: 298.150 k
press: 1.00000 atm
elementType: 16 8 8 8 8 8 7 6 6 6 6 6 6 6 6 6 6 6 1 1 1 1 1 1 1 1 1 1 1 1 1 1 1
symmnumber: 1
zpe: 655313.2 jmol-1
zpe.correction: 0.249596 hartree
zpe.thermalcorrener: 0.268446 hartree
zpe.thermalcorrenthalpy: 0.269390 hartree
zpe.thermalcorrgfe: 0.201713 hartree
zpe.sumelectzpe: -1255.542219 hartree
zpe.sumelectthermal: -1255.523369 hartree
zpe.sumelectthermalent: -1255.522424 hartree
zpe.sumelectthermalfe: -1255.590101 hartree
dipole: 2.9596 2.5947 -5.8335
dipole: 7.0372
quadrupole: -105.3403 -112.7626 -115.8923
quadrupole: 8.6246 8.7515 -0.0372
quadrupole: 5.9915 -1.4309 -4.5606 8.6246 8.7515 -0.0372
hfenergy: -1255.7918143 hartree
pointgroup: C01 [X(C11H15N1O5S1)]
dipole: 0.9961284 0.9757191 -2.3918627 debye
polarizability: 215.8503202|12.6429979|177.3787569|-11.9543957|-3.0761064|121.9834719 unknown
InChI: InChI=1S/C11H15NO5S/c1-2-12(6-7-13)18(16,17)10-5-3-4-9(8-10)11(14)15/h3-5,8,13-14H,2,6-7H2,1H3
charge 0 multiplicity 1
33 atoms
S  -1.068547 -0.113323 0.980472
O  -0.718768 -1.257715 2.082166
O  -2.036343 1.156406 1.357143
O  -4.612116 -0.521952 -1.871234
O  5.146588 0.212508 -1.00052
O  3.980026 -1.750137 -0.566326
N  -1.623431 -1.036982 -0.548849
C  -2.134009 -0.117741 -1.595521
C  -2.325118 -2.313493 -0.210079
C  0.54911 0.648996 0.351212
C  -3.572279 0.449796 -1.497899
C  -3.625845 -2.232856 0.618469
C  1.62914 -0.198732 0.080776
C  0.609115 2.04884 0.251299
C  2.845361 0.400764 -0.334996
C  1.831501 2.630224 -0.162486
C  2.943013 1.812307 -0.455826
C  3.996293 -0.499062 -0.629871
H  -2.017296 -0.664642 -2.554944
H  -1.428233 0.736299 -1.642352
H  -2.523015 -2.782719 -1.194002
H  -1.586651 -2.941828 0.317995
H  -3.634541 1.350856 -2.14591
H  -3.798722 0.749903 -0.463579
H  -3.434202 -1.761655 1.598389
H  -4.414297 -1.682804 0.082114
H  -3.98891 -3.259944 0.811266
H  1.560048 -1.286093 0.186299
H  -0.269448 2.650043 0.510171
H  1.91317 3.718225 -0.248305
H  3.892944 2.251251 -0.77256
H  -4.535224 -0.729641 -2.836606
H  5.882188 -0.432498 -1.179806
