program: Gaussian 09
title: 000257470
version: EM64L-G09RevD.01
frameworkgroup: C1[X(C10H13NO5S)]
method: RPBEPBE
basis: SDD
operation: Freq
keyword: #p
keyword: freq=noraman
keyword: PBEPBE/SDD
title: #p freq=noraman PBEPBE/SDD
converged: YES YES NO NO
title: Mulliken charges:
elementType: S O O O O O N C C C C C C C C C C H H H H H H H H H H H H H
charge: 0.908195 -0.545538 -0.516871 -0.452944 -0.437285 -0.236398 -0.254789 -0.432773 0.015591 -0.619127 -0.296654 -0.358631 -0.241413 0.266008 -0.191439 -0.318178 0.124769 0.254459 0.245953 0.279030 0.237713 0.260749 0.200384 0.211840 0.316483 0.285992 0.248122 0.284882 0.370236 0.391633
chargesum: 0.00000
title: Mulliken charges with hydrogens summed into heavy atoms:
elementType: S O O O O O N C C C C C C C C C C
charge: 0.908195 -0.545538 -0.516871 -0.082709 -0.045652 -0.236398 -0.254789 0.067639 0.015591 0.158365 0.115570 -0.042148 0.044579 0.266008 0.056684 -0.033296 0.124769
polarizability: 2.09669319e+02 2.48283862e+00 1.67923693e+02 1.05849055e+00 4.46847612e+00 1.08039920e+02
1716.lowfreq: -13.4977 -0.0021 -0.0015 -0.0005 4.2449 7.2450 13.3126 29.9566 50.1761
frequency: 9.5198 29.8134 50.1136 73.9633 95.9459 121.3203 145.5873 154.7468 170.7722 189.8750 201.9991 217.6341 234.5034 239.8954 266.3745 293.1158 320.1552 354.6736 366.8710 393.1226 404.3861 423.0722 459.9685 500.8506 509.5457 591.3528 598.5117 605.4811 654.5656 681.2299 690.9149 729.2591 767.7939 781.7410 788.2656 823.5367 824.5469 914.8188 941.7584 950.5350 960.6785 981.1905 1000.9831 1008.4203 1023.8001 1048.8543 1064.2673 1079.6711 1089.1221 1122.7852 1149.7793 1162.0935 1179.0811 1214.1002 1228.3409 1272.5043 1323.3211 1344.8456 1360.0116 1389.6348 1400.1049 1409.3096 1423.9150 1426.9244 1438.4902 1459.9881 1472.8689 1497.3062 1571.8605 1610.0013 1647.0419 2947.8186 2975.2215 2985.2103 3040.1282 3062.5528 3068.7311 3105.9429 3152.0811 3161.8550 3167.9804 3185.2336 3315.2391 3533.9920
redmass: 4.7061 6.0414 7.3932 6.2701 8.8836 4.1054 4.8571 4.6442 1.2883 5.7871 3.5907 5.1247 4.9918 6.1752 2.8711 4.6930 6.6289 5.1768 4.8934 7.1653 3.2747 3.1650 5.5048 5.6397 4.3623 4.6265 2.5071 1.3672 6.1835 2.8957 1.2563 3.1700 6.9381 3.6672 6.2973 1.5230 2.3292 11.0845 2.6591 1.3720 1.4625 5.6029 2.0382 1.3748 4.6034 3.8038 1.8862 1.4247 1.6475 1.7410 1.7848 2.1793 1.1137 1.1746 1.2167 1.3644 2.3293 1.2589 1.1961 8.0023 1.1757 1.1328 2.4914 1.1402 1.0475 2.6349 1.0723 1.0575 6.7049 7.0033 9.0752 1.0686 1.0344 1.0623 1.0958 1.0972 1.1026 1.0990 1.0879 1.0926 1.0943 1.0976 1.0681 1.0643
irintensity: 1.3620 1.4219 1.1759 0.1747 0.9315 10.3461 5.3538 0.4056 0.1701 10.4121 1.9698 3.9225 3.9199 10.4164 11.7368 24.4962 2.9293 3.6469 15.4901 6.8170 21.4305 8.8460 159.9544 1.0184 30.3188 57.1689 20.4771 162.1998 13.2579 0.4622 330.5918 68.7537 21.0562 28.7804 17.3296 22.6214 13.7843 54.0758 16.5249 1.7509 7.6151 5.7947 17.8307 0.9413 302.2126 23.6565 2.6664 39.6892 19.8005 17.3636 126.4736 7.7816 0.3979 4.0221 22.0479 26.6516 93.3572 12.0399 1.8230 1.0935 36.5607 24.4255 33.0593 17.5756 11.3235 7.9621 9.2413 9.9079 17.2808 5.3376 216.3573 84.2817 23.5528 31.7929 5.1681 37.3035 13.9458 4.4657 4.8426 6.4787 5.1900 4.1221 193.5843 57.6149
temp: 298.150 k
press: 1.00000 atm
elementType: 16 8 8 8 8 8 7 6 6 6 6 6 6 6 6 6 6 1 1 1 1 1 1 1 1 1 1 1 1 1
symmnumber: 1
zpe: 583989.5 jmol-1
zpe.correction: 0.222430 hartree
zpe.thermalcorrener: 0.240297 hartree
zpe.thermalcorrenthalpy: 0.241242 hartree
zpe.thermalcorrgfe: 0.174701 hartree
zpe.sumelectzpe: -1216.326487 hartree
zpe.sumelectthermal: -1216.308619 hartree
zpe.sumelectthermalent: -1216.307675 hartree
zpe.sumelectthermalfe: -1216.374216 hartree
dipole: -4.1577 1.4291 5.4696
dipole: 7.0174
quadrupole: -99.4955 -105.9093 -112.5122
quadrupole: -3.0534 12.1655 -0.6161
quadrupole: 6.4769 0.0630 -6.5398 -3.0534 12.1655 -0.6161
hfenergy: -1216.5489167 hartree
pointgroup: C01 [X(C10H13N1O5S1)]
dipole: 1.8199811 0.2852694 -2.0563844 debye
polarizability: 208.5914981|-3.5877092|166.9231818|8.7188318|-10.2261462|110.1182524 unknown
InChI: InChI=1S/C10H13NO5S/c1-11(5-6-12)17(15,16)9-4-2-3-8(7-9)10(13)14/h2-4,7,12-13H,5-6H2,1H3
charge 0 multiplicity 1
30 atoms
S  -1.387666 0.664237 0.479019
O  -1.558556 -0.622042 1.503681
O  -1.918482 2.156786 0.857323
O  -4.076132 -1.174585 0.459695
O  4.861148 -1.163494 0.085853
O  3.092555 -2.547284 0.685838
N  -2.046447 0.227508 -1.288342
C  -2.333743 -1.236099 -1.363052
C  0.466027 0.792245 0.151042
C  -3.177966 1.129005 -1.635242
C  -3.714569 -1.719855 -0.84088
C  1.262683 -0.337658 0.360316
C  0.967334 2.038879 -0.261344
C  2.655169 -0.212726 0.117389
C  2.35805 2.145833 -0.49235
C  3.198127 1.0256 -0.310651
C  3.5050 -1.418714 0.331357
H  -1.523709 -1.762373 -0.824871
H  -2.236372 -1.50347 -2.435159
H  -4.115246 0.900996 -1.095136
H  -3.332975 1.020727 -2.725278
H  -2.88806 2.170681 -1.423879
H  -3.694578 -2.831928 -0.830849
H  -4.522901 -1.403872 -1.523606
H  0.84739 -1.282636 0.725714
H  0.296009 2.896383 -0.372585
H  2.781556 3.103381 -0.810465
H  4.274438 1.098545 -0.487927
H  -3.283693 -1.200701 1.075942
H  5.382308 -1.995865 0.243547
